harmony-alerts mailing list archives

Site index · List index
Message view « Date » · « Thread »
Top « Date » · « Thread »
From nom...@intel.com
Subject [build-test alert] FAILED Windows 2003 x86_64: hdk debug
Date Thu, 14 Feb 2008 05:56:39 GMT

BUILD FAILED:
	Ant Error Message:
C:\cc\cc-common\scripts\cc-exec-adaptor.xml:104: The following error occurred while executing
this line: C:\cc\cc-common\adaptors\hdk\adaptor.xml:48: The following error occurred while
executing this line: C:\cc\cc-common\scripts\framework.xml:1079: Java returned: 1

Date of build:	2008-02-14 11:55:12 +0600
Time to build:	57 seconds
Last changed:	02/14/2008 11:36:51
Last log entry:	Old build is no more

***********************************************************
Errors/Warnings:	(4)
            
BUILD FAILED
C:\cc\cc-common\build\checkouts\hdk\build.xml:485: exec returned: 1
Total time: 46 seconds
The execution FAILED with the following exception:
The following error occurred while executing this line:
C:\cc\cc-common\adaptors\hdk\adaptor.xml:48: The following error occurred while executing
this line:
C:\cc\cc-common\scripts\framework.xml:1079: Java returned: 1

***********************************************************
Unit Tests: (0)
        
No Tests Run: This project doesn't have any tests

***********************************************************
Modifications since last successful build:	(9)
            
deleted varlax  /harmony/enhanced/drlvm/trunk/build/build.sh 02/14/2008 11:36:51 Old build
is no more
deleted varlax  /harmony/enhanced/drlvm/trunk/build/drlvm.properties.example 02/14/2008 11:36:51
Old build is no more
deleted varlax  /harmony/enhanced/drlvm/trunk/build/README.txt 02/14/2008 11:36:51 Old build
is no more
deleted varlax  /harmony/enhanced/drlvm/trunk/build/make 02/14/2008 11:36:51 Old build is
no more
deleted varlax  /harmony/enhanced/drlvm/trunk/build/build.bat 02/14/2008 11:36:51 Old build
is no more
deleted varlax  /harmony/enhanced/drlvm/trunk/build/patches 02/14/2008 11:36:51 Old build
is no more
deleted varlax  /harmony/enhanced/drlvm/trunk/build/make/excludes 02/14/2008 11:28:58 Place
exclude-lists nearby tests.
added varlax  /harmony/enhanced/drlvm/trunk/vm/tests/excludes 02/14/2008 11:28:58 Place exclude-lists
nearby tests.
modified varlax  /harmony/enhanced/drlvm/trunk/make/tests/test-common.xml 02/14/2008 11:28:58
Place exclude-lists nearby tests.

begin 644 execution_log.zip
M4$L#! H    (  ]?3C@T[U^?X (  &\(   2    97AE8W5T:6]N7VQO9RYH
M=&ULK5;?3]LP$'ZOQ/]P+U.WAR:%E=)EI5*A()A@#X.-!UI5KGUMO"9Q9#O]
ML;]^YR1 J;J238LBY8?O/M_W^>[L;FCCJ->=*+'N=5.-O2X#8]<1GM:G*K$-
M(W]A )WFN\_UWD$M2P6SV#"+)#BH'=1TYI[@KD=<(1]!WX+&A312)= ^.FFW
M.]Z3P4^V8",XRV0DIC(BT(E[]59Q]-KB]1=-U4BU2H-]1C*1=J^!"=5R[&#,
MEED9.P_5MLOFR(ZKGS(>(EPQ':MD#9<H4),THB!8#>JT\E4-C[1RZK_\"*!<
MA&K^*G4<9#(#LS868^>_E(E02U,-@&D>2HO<9AJ? EAUVN-VJ]%N581(+"@#
M"8O1=W .XJ&( 8Z:S8\^BT55K%"9G,T7LGH*Y] []IKC9@O>WV4)W$JN54'6
MP'7"O0_5D//4A5@)?%%:X"2;510ZLVEF(5*<Y*9*<>Z6Z1G::OYW/[Z"5LH^
M_R#_T%K*;M^G)/!8GIR>TC-?8ZJ,S\ST;>2]!80VVZY!]R8P0HLC&+BGTUI(
M3>NO]!K.@R'G=#>XBJE&AKEF0XJ+SXF_&89B/OP3Z<=X3D C.->8%Q5]!/\,
MN,5D*2T/QR33>!'O[@9Y)W,]#AY44K=0D,R7*XK6;MGE5!91E5SK>2SU-] N
MJ>V5IL.8S7%HT5C/M2745J*I0\A,,4TY29$?NZLOQQT\9V,AAS=ANW-HVSIE
MI +^#;()*QD+'2WB#5(>KEB<1EC)^=M%?W![X=G5WB4\^WY],X#+_O7-Q>#U
M2)44>=YV@E;G.  7 W5-:ED)B@ .]TU\KRPMC94Q[5ZM-A4%5XD@#6OWM!4X
MH"POYR(R:ITV!$LC4Q5%:NFJ U<<4V<3Y"X; UHK#8KS3&O*K&7H4J5$I&$;
M2DH,F2 E[#9')EA*25B0*S]*>@'\MUD,US(E!:>:.O-2Z7D^Q6'SY%-0]-<-
M">EDT/59K^OGYPF_.%OX^4'C-U!+ 0(4 PH    (  ]?3C@T[U^?X (  &\(
M   2              "D@0    !E>&5C=71I;VY?;&]G+FAT;6Q02P4&    
/  $  0!     $ ,      
end


Mime
View raw message