harmony-alerts mailing list archives

Site index · List index
Message view « Date » · « Thread »
Top « Date » · « Thread »
From nom...@intel.com
Subject [build-test alert] FAILED Windows 2003 x86: hdk debug
Date Thu, 14 Feb 2008 05:51:51 GMT

BUILD FAILED:
	Ant Error Message:
D:\cc\cc-common\scripts\cc-exec-adaptor.xml:104: The following error occurred while executing
this line: D:\cc\cc-common\adaptors\hdk\adaptor.xml:48: The following error occurred while
executing this line: D:\cc\cc-common\scripts\framework.xml:1079: Java returned: 1

Date of build:	2008-02-14 11:50:29 +0600
Time to build:	38 seconds
Last changed:	02/14/2008 11:36:51
Last log entry:	Old build is no more

***********************************************************
Errors/Warnings:	(7)
            
[cc-ant]: Test Suite 'hdk' execution. Repository updated: true
[cc-ant]: Result: failed.superiors = '${failed.superiors}'
[hdk]: Updating HDK workspace to revision: HEAD
BUILD FAILED
D:\cc\cc-common\build\checkouts\hdk\build.xml:485: exec returned: 1
Total time: 23 seconds
The execution FAILED with the following exception:
The following error occurred while executing this line:
D:\cc\cc-common\adaptors\hdk\adaptor.xml:48: The following error occurred while executing
this line:
D:\cc\cc-common\scripts\framework.xml:1079: Java returned: 1

***********************************************************
Unit Tests: (0)
        
No Tests Run: This project doesn't have any tests

***********************************************************
Modifications since last successful build:	(9)
            
deleted varlax  /harmony/enhanced/drlvm/trunk/build/build.sh 02/14/2008 11:36:51 Old build
is no more
deleted varlax  /harmony/enhanced/drlvm/trunk/build/drlvm.properties.example 02/14/2008 11:36:51
Old build is no more
deleted varlax  /harmony/enhanced/drlvm/trunk/build/README.txt 02/14/2008 11:36:51 Old build
is no more
deleted varlax  /harmony/enhanced/drlvm/trunk/build/make 02/14/2008 11:36:51 Old build is
no more
deleted varlax  /harmony/enhanced/drlvm/trunk/build/build.bat 02/14/2008 11:36:51 Old build
is no more
deleted varlax  /harmony/enhanced/drlvm/trunk/build/patches 02/14/2008 11:36:51 Old build
is no more
deleted varlax  /harmony/enhanced/drlvm/trunk/build/make/excludes 02/14/2008 11:28:58 Place
exclude-lists nearby tests.
added varlax  /harmony/enhanced/drlvm/trunk/vm/tests/excludes 02/14/2008 11:28:58 Place exclude-lists
nearby tests.
modified varlax  /harmony/enhanced/drlvm/trunk/make/tests/test-common.xml 02/14/2008 11:28:58
Place exclude-lists nearby tests.

begin 644 execution_log.zip
M4$L#! H    ( 'A>3CBEY*K"\@(  )@(   2    97AE8W5T:6]N7VQO9RYH
M=&ULK5;=;]HP$']'ZO]P+Q/; PG0E;*,(M'1JMW:/:SM^E 0,LY!O#IQ9#M\
M[*_?.0':,DJC:5:DQ/'=SW>_^[ [D8UEMS-6X;+;235V.PR,74H\J4Y48FM&
M_,8 VO5WGZO=@TJ6ALQBS<R2X*!R4-&9>X,;#\@C-82'*'P<!G#GY$0RA8O^
M-Y@K_6A2QA&L HTS881* K@XZ_4WR@OD0^C9S3*TFL>M5MM;"_QB,S:$TTS(
M<"(D631VG]XBEB\E7L[(SEJJ51KL$Q*)L'L%3*3F(P=CML2>._[ZRH[1(S8B
MA NF8Y4LX1Q#U,1K6#A8#NJD]"B'1UPY]I]^!+ *0CE]E3H?7,S-TEB,G?Y<
M)*&:FW( 3/-(6.0VT[@V8-%NU0Z;)?43"\I PF+T'9;3OR\,@&:]?N@36#FD
M2)G<D:\DM;:DX1UY]5&C#N]OL@2N!=>J\-/ 9<*]#^60\ZR%6(7X1'*(XVQ:
MDN/,IID%J3@Q347BU"W34[3E]&]^?@>ME-W\(/W(6DILWZ?X>RS/2T_IJ:\Q
M5<9G9O(V\M[:09MMEY_["E&BQ2'TW=MQ'0I-H5=Z"?U@P#D]-:YB*H]!SMF 
M[.*/Y+\94(<9O.;T0_Q(0$/XHC&O)YH$_PRXY<E<6!Z-B*;1+-[="/(FUM_$
MN=C(&[/=T=F63AGAX^YBV8ULHE+"H9:SV',-#+45:#Q<L#B56$KY!W7IZS//
M+O8XX8X#N%=)U4(1USQ#I5RZ3!<3401B%=YJCEM] ^T*)_9O%*4A2V:HW0E!
M4W<2F'TQ.[V[O.K#>>_RZJS_<J5,3FR.F.!C^R@ 9QUU2&I/M'< C7T;WRK+
M)%@1TTG5/*0JX"H)R=3*+;5]!Y3E]5M81FW21F!I9:*D5'-7#KC@F#J9(%=Y
MMJ UL: XS[0F"N81<;!&I&4;"0-2)$@9NNTC"UE*(2B<6TU6[@7PWW8Q7(N4
M&)QH:L3NZ,^W:-2//P5%0WU&(5TA.C[K=OS\XN$7EQ _OY'\ 5!+ 0(4 PH 
M   ( 'A>3CBEY*K"\@(  )@(   2              "D@0    !E>&5C=71I
A;VY?;&]G+FAT;6Q02P4&      $  0!     (@,      
end


Mime
View raw message