harmony-alerts mailing list archives

Site index · List index
Message view « Date » · « Thread »
Top « Date » · « Thread »
From nom...@intel.com
Subject [build-test alert] FAILED Linux x86: hdk debug
Date Thu, 14 Feb 2008 05:47:23 GMT

BUILD FAILED:
	Ant Error Message:
/export/users/cc/cc-common/scripts/cc-exec-adaptor.xml:104: The following error occurred while
executing this line: /export/users/cc/cc-common/adaptors/hdk/adaptor.xml:48: The following
error occurred while executing this line: /export/users/cc/cc-common/scripts/framework.xml:1079:
Java returned: 1

Date of build:	2008-02-14 11:46:10 +0600
Time to build:	30 seconds
Last changed:	02/14/2008 11:36:51
Last log entry:	Old build is no more

***********************************************************
Errors/Warnings:	(4)
            
BUILD FAILED
/export/users/cc/cc-common/build/checkouts/hdk/build.xml:485: exec returned: 1
Total time: 24 seconds
The execution FAILED with the following exception:
The following error occurred while executing this line:
/export/users/cc/cc-common/adaptors/hdk/adaptor.xml:48: The following error occurred while
executing this line:
/export/users/cc/cc-common/scripts/framework.xml:1079: Java returned: 1

***********************************************************
Unit Tests: (0)
        
No Tests Run: This project doesn't have any tests

***********************************************************
Modifications since last successful build:	(9)
            
deleted varlax  /harmony/enhanced/drlvm/trunk/build/build.sh 02/14/2008 11:36:51 Old build
is no more
deleted varlax  /harmony/enhanced/drlvm/trunk/build/drlvm.properties.example 02/14/2008 11:36:51
Old build is no more
deleted varlax  /harmony/enhanced/drlvm/trunk/build/README.txt 02/14/2008 11:36:51 Old build
is no more
deleted varlax  /harmony/enhanced/drlvm/trunk/build/make 02/14/2008 11:36:51 Old build is
no more
deleted varlax  /harmony/enhanced/drlvm/trunk/build/build.bat 02/14/2008 11:36:51 Old build
is no more
deleted varlax  /harmony/enhanced/drlvm/trunk/build/patches 02/14/2008 11:36:51 Old build
is no more
deleted varlax  /harmony/enhanced/drlvm/trunk/build/make/excludes 02/14/2008 11:28:58 Place
exclude-lists nearby tests.
added varlax  /harmony/enhanced/drlvm/trunk/vm/tests/excludes 02/14/2008 11:28:58 Place exclude-lists
nearby tests.
modified varlax  /harmony/enhanced/drlvm/trunk/make/tests/test-common.xml 02/14/2008 11:28:58
Place exclude-lists nearby tests.

begin 644 execution_log.zip
M4$L#! H    ( .A=3CB,2!8QS (  %P(   2    97AE8W5T:6]N7VQO9RYH
M=&ULM5;=;]HP$'_GK[B7B>V!F'Z,LHPBT=%JG>@>UFY[J! RSD$\G#BR'0C[
MZW=.Z =M8:FT60AP[N[GN]]]Q+W8):K?F^IHW>]E!OL]#M:M%9XV9SIU+2M_
M8PC=]IN/S7XCSR+NL&67:=AHF)R^P:];+%",8># X%):J5/H')YT.MU@(__%
MEWP,9[E4T4PJPIOZOT&1J"V%K0T=TLJ,SL+=*C*5;H_8QGHU\1!V6VGCLXCU
M$X/'@A?6(.,B1OC,3:+3-5Q@A(;HB*K :B&=UEZUX(@C3_G#@Q VS-<RUYD/
M0*9SL&OK,/'F2J9Y4<N:&Q%+A\+E!N\.+[J=UM%A/?/4@;:0\@29A_+F(W\X
MDT?=3BV(6-O2^R^D=>?!0? ^:$_:'7A[G:=P)87157 6+E,1O*L%7)8G)#K"
M!UXCG.;S>K3F+LL=*"V(7.H%;^VXF:.K97[]XRL8K=W] S*/G:,J9HP2'O"R
M# -MYLQ@IBWC=O97X#U=@B[/GC7(;80*'8YAZ'\]R9$TE&MMUL"PR+1Q++=H
M+!."/BVA$VH*5A+'R#VQ(!8LBZ,%VQ'Z;;(@R#%\,E@V$6W"?P"]'=M*.A%/
MB+7),GEQ")2#R\\S^*G3IH,J[#)W2JU]"<B9K+S;1-\L'6GN!QOAS#T'T0;R
M=$F14570UH]"NQ-G>%^(5>C!E+]8/T^5,TXAOP;7QG5T(Z.62>"G*1HGT098
M\"136,?VV_E@>'4>N&)/JLZ^7XZ&<#&X')T/MP2O+(G[-TMXW'T?@O>%1B3-
M*&(\A(/=#MQHQQ4XF=#KZ?"8VD+H-+*-Q@V-?(^2E[U<.0A45S$XDLRT4GKE
M^P,+@9G7"4N31P)C*/%:B-P8ROHJIK3?(9+8Q=+ZJ8MA8T^H/.(9E5\5XV:S
MB3*$_W">%49F1.G,T'Q>:;,H#SMHGWP(JW'[F-,>X_T>*R\/K+I(L/)6\0=0
M2P$"% ,*    " #H74XXC$@6,<P"  !<"   $@              I($     
H97AE8W5T:6]N7VQO9RYH=&UL4$L%!@     !  $ 0    /P"      $! 
end


Mime
View raw message