harmony-alerts mailing list archives

Site index · List index
Message view « Date » · « Thread »
Top « Date » · « Thread »
From nom...@intel.com
Subject [build-test alert] FAILED Linux x86_64: hdk debug
Date Thu, 14 Feb 2008 06:40:00 GMT

BUILD FAILED:
	Ant Error Message:
/export/users/cc/cc-common/scripts/cc-exec-adaptor.xml:104: The following error occurred while
executing this line: /export/users/cc/cc-common/adaptors/hdk/adaptor.xml:48: The following
error occurred while executing this line: /export/users/cc/cc-common/scripts/framework.xml:1079:
Java returned: 1

Date of build:	2008-02-14 12:38:44 +0600
Time to build:	48 seconds
Last changed:	02/14/2008 11:36:51
Last log entry:	Old build is no more

***********************************************************
Errors/Warnings:	(4)
            
BUILD FAILED
/export/users/cc/cc-common/build/checkouts/hdk/build.xml:485: exec returned: 1
Total time: 37 seconds
The execution FAILED with the following exception:
The following error occurred while executing this line:
/export/users/cc/cc-common/adaptors/hdk/adaptor.xml:48: The following error occurred while
executing this line:
/export/users/cc/cc-common/scripts/framework.xml:1079: Java returned: 1

***********************************************************
Unit Tests: (0)
        
No Tests Run: This project doesn't have any tests

***********************************************************
Modifications since last successful build:	(9)
            
deleted varlax  /harmony/enhanced/drlvm/trunk/build/build.sh 02/14/2008 11:36:51 Old build
is no more
deleted varlax  /harmony/enhanced/drlvm/trunk/build/drlvm.properties.example 02/14/2008 11:36:51
Old build is no more
deleted varlax  /harmony/enhanced/drlvm/trunk/build/README.txt 02/14/2008 11:36:51 Old build
is no more
deleted varlax  /harmony/enhanced/drlvm/trunk/build/make 02/14/2008 11:36:51 Old build is
no more
deleted varlax  /harmony/enhanced/drlvm/trunk/build/build.bat 02/14/2008 11:36:51 Old build
is no more
deleted varlax  /harmony/enhanced/drlvm/trunk/build/patches 02/14/2008 11:36:51 Old build
is no more
deleted varlax  /harmony/enhanced/drlvm/trunk/build/make/excludes 02/14/2008 11:28:58 Place
exclude-lists nearby tests.
added varlax  /harmony/enhanced/drlvm/trunk/vm/tests/excludes 02/14/2008 11:28:58 Place exclude-lists
nearby tests.
modified varlax  /harmony/enhanced/drlvm/trunk/make/tests/test-common.xml 02/14/2008 11:28:58
Place exclude-lists nearby tests.

begin 644 execution_log.zip
M4$L#! H    ( /MD3CA#7'#4Z0(  (T(   2    97AE8W5T:6]N7VQO9RYH
M=&ULM5;;;MLP#'W/5_!ER/80*]U:M_72 .G28AW:/:S=]E $@2(QL1K;,B0Y
MEWW]*-N]I&LR%]B,(+Z0/"*/#FGW8I<F_=Y$RW6_EQOL]SA8MT[PI#W5F>M8
M]0LC..J^^=CNMXI<<H<=N\BB5LL4] _^N,45BA$,'!A<**MT!N'[PS ,@]I^
MQQ=\!*>%2N14)80W\9?!*DTV'#9N:)%.;G0>;7=1F7([S#;6R[&'L)M.=<XB
MUL\"GAI>. 8Y%S'"9VY2G:WA'"4:HD-6A35".FE\-((CCCSECP\BJ)EO%*YS
M7X#*9F#7UF'JPQ.5%:M&T=R(6#D4KC!XO_CJ*!R'^YUPOQE"YD!;R'B*S*-Y
MA$N_/N.I;(@1:UM6\(6\[K/8"PZ"[KA[#&^OBPRNE#"Z*M#"12:"=XV 2XE"
MJB4^<BMQ4LR:45NXO'"0:$$$4S_X:,?-#%VC\.L?7\%H[1X>4'CL'"F9,=KT
M@)=2#+29,8.YMHS;Z5^!=W0*NB+_HTEN)2;H< 1#?_8D2V5HO[59 \-5KHUC
MA45CF1#TZPB=4F.PDCA&Z8DYL6!9+.=L2^FWZ9P@1_#)8-E(=!/] ^C-VI;*
MB7A,K(T7Z8N#H!Q>?J;!3YVU'51EEWN7)&LO 355579U]>TRD?9NL'.:=+4G
M2_D<J2Z1%!+M_44@3;)(QS;5<PS*O@NJ_@GNT+4AYK;*H<Z@4I+=NNCP0;45
M3\&$ORBVY\XY)W[P%;@V;N);%A?X\8O&*;0!KGB:)]@D]MO98'AU%KC5CGT]
M_7YQ.83SP<7EV7##\$K]/+R*HOVC@PA\+C13::AE*"/8VY[ C7:T-TZE]#[[
M<$@])'0F;:MU0^\(CU*4C5\E""3"&!Q9ICI)]-(W$ZD <^\3E2%/#,9H UJ(
MPAB2W3+V0JH1R>QB9?V8QJBUHU0N>4Y:K6JL;^HJ(_@/ZUEA5$Z43@U-\Z4V
M\W*QO>[A<53-YJ><]ACO]UCYM<&J+P]6?H;\!E!+ 0(4 PH    ( /MD3CA#
M7'#4Z0(  (T(   2              "D@0    !E>&5C=71I;VY?;&]G+FAT
8;6Q02P4&      $  0!     &0,      
end


Mime
View raw message