harmony-alerts mailing list archives

Site index · List index
Message view « Date » · « Thread »
Top « Date » · « Thread »
From nom...@intel.com
Subject [build-test alert] FAILED Linux x86_64: jdktools-test debug
Date Wed, 13 Feb 2008 13:36:27 GMT

BUILD FAILED:
	Ant Error Message:
/export/users/cc/cc-common/scripts/cc-exec-adaptor.xml:104: The following error occurred while
executing this line: /export/users/cc/cc-common/adaptors/jdktools-test/adaptor.xml:24: The
following error occurred while executing this line: /export/users/cc/cc-common/build/checkouts/hdk/working_jdktools/build.xml:242:
The following error occurred while executing this line: /export/users/cc/cc-common/build/checkouts/hdk/working_jdktools/make/build-test.xml:97:
There were test errors.

Date of build:	2008-02-13 19:18:18 +0600
Time to build:	18 minutes 3 seconds
Last changed:	02/13/2008 16:45:38
Last log entry:	hdk

***********************************************************
Errors/Warnings:	(227)
            
Result: 1
========================================
Testing jdktools binaries...
========================================
Compiling JPDA tests
Since fork is false, ignoring memoryMaximumSize setting
----------
1. WARNING in /export/users/cc/cc-common/build/checkouts/hdk/working_jdktools/modules/jpda/src/test/java/org/apache/harmony/jpda/tests/framework/DebuggeeRegister.java
(at line 58)
registered.add(debuggee);
^^^^^^^^^^^^^^^^^^^^^^^^
Type safety: The method add(Object) belongs to the raw type LinkedList. References to generic
type LinkedList<E> should be parameterized
----------
----------
2. WARNING in /export/users/cc/cc-common/build/checkouts/hdk/working_jdktools/modules/jpda/src/test/java/org/apache/harmony/jpda/tests/framework/TestOptions.java
(at line 505)
internalProperties.put(name, value);
^^^^^^^^^^^^^^^^^^^^^^^^^^^^^^^^^^^
Type safety: The method put(Object, Object) belongs to the raw type HashMap. References to
generic type HashMap<K,V> should be parameterized
----------
----------
3. WARNING in /export/users/cc/cc-common/build/checkouts/hdk/working_jdktools/modules/jpda/src/test/java/org/apache/harmony/jpda/tests/framework/jdwp/PacketDispatcher.java
(at line 114)
eventQueue.add(eventPacket);
^^^^^^^^^^^^^^^^^^^^^^^^^^^
Type safety: The method add(Object) belongs to the raw type List. References to generic type
List<E> should be parameterized
----------
4. WARNING in /export/users/cc/cc-common/build/checkouts/hdk/working_jdktools/modules/jpda/src/test/java/org/apache/harmony/jpda/tests/framework/jdwp/PacketDispatcher.java
(at line 249)
replies.put(new Integer(replyPacket.getId()),
replyPacket);
^^^^^^^^^^^^^^^^^^^^^^^^^^^^^^^^^^^^^^^^^^^^^^^^^^^^^^^^^^^^^^^^^^^^^^^^^^^^^^^^^^^^^^^^^^
Type safety: The method put(Object, Object) belongs to the raw type Hashtable. References
to generic type Hashtable<K,V> should be parameterized
----------
5. WARNING in /export/users/cc/cc-common/build/checkouts/hdk/working_jdktools/modules/jpda/src/test/java/org/apache/harmony/jpda/tests/framework/jdwp/PacketDispatcher.java
(at line 284)
commands.put(Id, command);
^^^^^^^^^^^^^^^^^^^^^^^^^
Type safety: The method put(Object, Object) belongs to the raw type Hashtable. References
to generic type Hashtable<K,V> should be parameterized
----------
6. WARNING in /export/users/cc/cc-common/build/checkouts/hdk/working_jdktools/modules/jpda/src/test/java/org/apache/harmony/jpda/tests/framework/jdwp/PacketDispatcher.java
(at line 355)
commands.put(Id, command);
^^^^^^^^^^^^^^^^^^^^^^^^^
Type safety: The method put(Object, Object) belongs to the raw type Hashtable. References
to generic type Hashtable<K,V> should be parameterized
----------
----------
7. WARNING in /export/users/cc/cc-common/build/checkouts/hdk/working_jdktools/modules/jpda/src/test/java/org/apache/harmony/jpda/tests/framework/jdwp/VmMirror.java
(at line 1834)
frames.add(frame);
^^^^^^^^^^^^^^^^^
Type safety: The method add(Object) belongs to the raw type ArrayList. References to generic
type ArrayList<E> should be parameterized
----------
8. WARNING in /export/users/cc/cc-common/build/checkouts/hdk/working_jdktools/modules/jpda/src/test/java/org/apache/harmony/jpda/tests/framework/jdwp/VmMirror.java
(at line 1902)
vars.add(var);
^^^^^^^^^^^^^
Type safety: The method add(Object) belongs to the raw type ArrayList. References to generic
type ArrayList<E> should be parameterized
----------
9. WARNING in /export/users/cc/cc-common/build/checkouts/hdk/working_jdktools/modules/jpda/src/test/java/org/apache/harmony/jpda/tests/framework/jdwp/VmMirror.java
(at line 2122)
fields.add(superClassFields.toArray()[i]);
^^^^^^^^^^^^^^^^^^^^^^^^^^^^^^^^^^^^^^^^^
Type safety: The method add(Object) belongs to the raw type ArrayList. References to generic
type ArrayList<E> should be parameterized
----------
10. WARNING in /export/users/cc/cc-common/build/checkouts/hdk/working_jdktools/modules/jpda/src/test/java/org/apache/harmony/jpda/tests/framework/jdwp/VmMirror.java
(at line 2132)
fields.add(field);
^^^^^^^^^^^^^^^^^
Type safety: The method add(Object) belongs to the raw type ArrayList. References to generic
type ArrayList<E> should be parameterized
----------
----------
11. WARNING in /export/users/cc/cc-common/build/checkouts/hdk/working_jdktools/modules/jpda/src/test/java/org/apache/harmony/jpda/tests/jdwp/DebuggerOnDemand/OnthowDebuggerLaunchDebuggee.java
(at line 94)
class ExceptionForDebugger extends Exception {
^^^^^^^^^^^^^^^^^^^^
The serializable class ExceptionForDebugger does not declare a static final serialVersionUID
field of type long
----------
----------
12. WARNING in /export/users/cc/cc-common/build/checkouts/hdk/working_jdktools/modules/jpda/src/test/java/org/apache/harmony/jpda/tests/jdwp/Events/ClassUnloadDebuggee.java
(at line 32)
import java.util.LinkedList;
^^^^^^^^^^^^^^^^^^^^
The import java.util.LinkedList is never used
----------
13. WARNING in /export/users/cc/cc-common/build/checkouts/hdk/working_jdktools/modules/jpda/src/test/java/org/apache/harmony/jpda/tests/jdwp/Events/ClassUnloadDebuggee.java
(at line 97)
boolean isOutOfMemory = false;
^^^^^^^^^^^^^
The local variable isOutOfMemory is never read
----------
14. WARNING in /export/users/cc/cc-common/build/checkouts/hdk/working_jdktools/modules/jpda/src/test/java/org/apache/harmony/jpda/tests/jdwp/Events/ClassUnloadDebuggee.java
(at line 171)
public Class loadClass(String name) throws ClassNotFoundException {
^^^^^
Type safety: The return type Class for loadClass(String) from the type ClassUnloadDebuggee.CustomLoader
needs unchecked conversion to conform to Class<?> from the type ClassLoader
----------
15. WARNING in /export/users/cc/cc-common/build/checkouts/hdk/working_jdktools/modules/jpda/src/test/java/org/apache/harmony/jpda/tests/jdwp/Events/ClassUnloadDebuggee.java
(at line 179)
public Class findClass(String name) throws ClassNotFoundException {
^^^^^
Type safety: The return type Class for findClass(String) from the type ClassUnloadDebuggee.CustomLoader
needs unchecked conversion to conform to Class<?> from the type ClassLoader
----------
----------
16. WARNING in /export/users/cc/cc-common/build/checkouts/hdk/working_jdktools/modules/jpda/src/test/java/org/apache/harmony/jpda/tests/jdwp/Events/CombinedEvents002Test.java
(at line 100)
boolean expectColocatedEvents = (testedMethodStartCodeIndex == testedMethodEndCodeIndex);
^^^^^^^^^^^^^^^^^^^^^
The local variable expectColocatedEvents is never read
----------
----------
17. WARNING in /export/users/cc/cc-common/build/checkouts/hdk/working_jdktools/modules/jpda/src/test/java/org/apache/harmony/jpda/tests/jdwp/Events/CombinedEvents003Test.java
(at line 53)
private boolean eventMethodExitReceived = false;
^^^^^^^^^^^^^^^^^^^^^^^
The field CombinedEvents003Test.eventMethodExitReceived is never read locally
----------
18. WARNING in /export/users/cc/cc-common/build/checkouts/hdk/working_jdktools/modules/jpda/src/test/java/org/apache/harmony/jpda/tests/jdwp/Events/CombinedEvents003Test.java
(at line 76)
int EXPECTED_EVENTS_COUNT = EXPECTED_EVENTS_ARRAY.length;
^^^^^^^^^^^^^^^^^^^^^
The local variable EXPECTED_EVENTS_COUNT is never read
----------
----------
19. WARNING in /export/users/cc/cc-common/build/checkouts/hdk/working_jdktools/modules/jpda/src/test/java/org/apache/harmony/jpda/tests/jdwp/Events/CombinedEventsTest.java
(at line 84)
int EXPECTED_EVENTS_COUNT = EXPECTED_EVENTS_ARRAY.length;
^^^^^^^^^^^^^^^^^^^^^
The local variable EXPECTED_EVENTS_COUNT is never read
----------
20. WARNING in /export/users/cc/cc-common/build/checkouts/hdk/working_jdktools/modules/jpda/src/test/java/org/apache/harmony/jpda/tests/jdwp/Events/CombinedEventsTest.java
(at line 212)
int EXPECTED_EVENTS_COUNT = EXPECTED_EVENTS_ARRAY.length;
^^^^^^^^^^^^^^^^^^^^^
The local variable EXPECTED_EVENTS_COUNT is never read
----------
21. WARNING in /export/users/cc/cc-common/build/checkouts/hdk/working_jdktools/modules/jpda/src/test/java/org/apache/harmony/jpda/tests/jdwp/Events/CombinedEventsTest.java
(at line 348)
int EXPECTED_EVENTS_COUNT = EXPECTED_EVENTS_ARRAY.length;
^^^^^^^^^^^^^^^^^^^^^
The local variable EXPECTED_EVENTS_COUNT is never read
----------
22. WARNING in /export/users/cc/cc-common/build/checkouts/hdk/working_jdktools/modules/jpda/src/test/java/org/apache/harmony/jpda/tests/jdwp/Events/CombinedEventsTest.java
(at line 732)
String failureMessage = "## FAILURE during checking events! !";
^^^^^^^^^^^^^^
The local variable failureMessage is never read
----------
23. WARNING in /export/users/cc/cc-common/build/checkouts/hdk/working_jdktools/modules/jpda/src/test/java/org/apache/harmony/jpda/tests/jdwp/Events/CombinedEventsTest.java
(at line 894)
String failureMessage = "## FAILURE during checking events !";
^^^^^^^^^^^^^^
The local variable failureMessage is never read
----------
----------
24. WARNING in /export/users/cc/cc-common/build/checkouts/hdk/working_jdktools/modules/jpda/src/test/java/org/apache/harmony/jpda/tests/jdwp/Events/CombinedEventsTestCase.java
(at line 135)
long methodStartCodeIndex = lineTableReply.getNextValueAsLong();
^^^^^^^^^^^^^^^^^^^^
The local variable methodStartCodeIndex is never read
----------
25. WARNING in /export/users/cc/cc-common/build/checkouts/hdk/working_jdktools/modules/jpda/src/test/java/org/apache/harmony/jpda/tests/jdwp/Events/CombinedEventsTestCase.java
(at line 187)
long methodStartCodeIndex = reply.getNextValueAsLong();
^^^^^^^^^^^^^^^^^^^^
The local variable methodStartCodeIndex is never read
----------
----------
26. WARNING in /export/users/cc/cc-common/build/checkouts/hdk/working_jdktools/modules/jpda/src/test/java/org/apache/harmony/jpda/tests/jdwp/Events/ExceptionTest.java
(at line 188)
long frameID = reply.getNextValueAsFrameID();
^^^^^^^
The local variable frameID is never read
----------
----------
27. WARNING in /export/users/cc/cc-common/build/checkouts/hdk/working_jdktools/modules/jpda/src/test/java/org/apache/harmony/jpda/tests/jdwp/ThreadReference/FramesTest.java
(at line 450)
frames.add(new FrameStruct(frameID, loc));
^^^^^^^^^^^^^^^^^^^^^^^^^^^^^^^^^^^^^^^^^
Type safety: The method add(Object) belongs to the raw type Vector. References to generic
type Vector<E> should be parameterized
----------
----------
28. WARNING in /export/users/cc/cc-common/build/checkouts/hdk/working_jdktools/modules/jpda/src/test/java/org/apache/harmony/jpda/tests/jdwp/share/JDWPUnitDebuggeeProcessWrapper.java
(at line 233)
argv.add(val);
^^^^^^^^^^^^^
Type safety: The method add(Object) belongs to the raw type Vector. References to generic
type Vector<E> should be parameterized
----------
29. WARNING in /export/users/cc/cc-common/build/checkouts/hdk/working_jdktools/modules/jpda/src/test/java/org/apache/harmony/jpda/tests/jdwp/share/JDWPUnitDebuggeeProcessWrapper.java
(at line 253)
return (String[])argv.toArray(args);
^^^^^^^^^^^^^^^^^^
Type safety: The method toArray(Object[]) belongs to the raw type Vector. References to generic
type Vector<E> should be parameterized
----------
29 problems (29 warnings)
JPDA exclude list: /export/users/cc/cc-common/build/checkouts/hdk/working_classlib/deploy/build/jdktools.jpda.exclude
Running JPDA tests
Debugger JVM=/export/users/cc/cc-common/build/checkouts/hdk/target/hdk/jdk/jre/bin/java
Debuggee JVM=/export/users/cc/cc-common/build/checkouts/hdk/target/hdk/jdk/jre/bin/java
SAMSA exclude list: /export/users/cc/cc-common/build/checkouts/hdk/working_classlib/deploy/build/jdktools.samsa.exclude
Running SAMSA tests
test.jre.home=/export/users/cc/cc-common/build/checkouts/hdk/target/hdk/jdk/jre
Run jdk/bin/java -version in /export/users/cc/cc-common/build/checkouts/hdk/working_jdktools/build/test_report
java version "1.5.0"
pre-alpha : not complete or compatible
svn = r627328, (Feb 13 2008), Linux/em64t/gcc 4.1.0, debug build
http://harmony.apache.org
Run jdk/bin/javac -version in /export/users/cc/cc-common/build/checkouts/hdk/working_jdktools/build/test_report
Run jdk/bin/javah in /export/users/cc/cc-common/build/checkouts/hdk/working_jdktools/build/test_report
Run jdk/bin/javadoc in /export/users/cc/cc-common/build/checkouts/hdk/working_jdktools/build/test_report
Run jdk/bin/jarsigner in /export/users/cc/cc-common/build/checkouts/hdk/working_jdktools/build/test_report
Run jdk/bin/keytool -help in /export/users/cc/cc-common/build/checkouts/hdk/working_jdktools/build/test_report
Run jdk/bin/unpack200 in /export/users/cc/cc-common/build/checkouts/hdk/working_jdktools/build/test_report
Compiling TOOLS tests
Since fork is false, ignoring memoryMaximumSize setting
----------
1. WARNING in /export/users/cc/cc-common/build/checkouts/hdk/working_jdktools/modules/tools/src/test/java/org/apache/harmony/tests/tools/javah/Test/Test01.java
(at line 24)
private static final long xxx2 = 1;
^^^^
The field Test01.xxx2 is never read locally
----------
1 problem (1 warning)
TOOLS exclude list: /export/users/cc/cc-common/build/checkouts/hdk/working_classlib/deploy/build/jdktools.tools.exclude
Running TOOLS tests
test.jre.home=/export/users/cc/cc-common/build/checkouts/hdk/target/hdk/jdk/jre
The test report is in /export/users/cc/cc-common/build/checkouts/hdk/working_jdktools/build/test_report/html/index.html
The execution FAILED with the following exception:
The following error occurred while executing this line:
/export/users/cc/cc-common/adaptors/jdktools-test/adaptor.xml:24: The following error occurred
while executing this line:
/export/users/cc/cc-common/build/checkouts/hdk/working_jdktools/build.xml:242: The following
error occurred while executing this line:
/export/users/cc/cc-common/build/checkouts/hdk/working_jdktools/make/build-test.xml:97: There
were test errors.

***********************************************************
Unit Tests: (160)
        
error: testCombinedEvents_02 org.apache.harmony.jpda.tests.jdwp.Events.CombinedEventsTest
error: testCombinedEvents_04 org.apache.harmony.jpda.tests.jdwp.Events.CombinedEventsTest
error: testSingleStep1 org.apache.harmony.jpda.tests.jdwp.Events.SingleStepTest
Unit Test Error Details:	(3)
                
Test: testCombinedEvents_02Class: org.apache.harmony.jpda.tests.jdwp.Events.CombinedEventsTestorg.apache.harmony.jpda.tests.framework.TestErrorException:
org.apache.harmony.jpda.tests.framework.jdwp.exceptions.TimeoutException: Connection was closed
	at org.apache.harmony.jpda.tests.framework.jdwp.VmMirror.receiveEvent(VmMirror.java:1698)
	at org.apache.harmony.jpda.tests.jdwp.Events.CombinedEventsTest.receiveAndCheckEvents(CombinedEventsTest.java:920)
	at org.apache.harmony.jpda.tests.jdwp.Events.CombinedEventsTest.testCombinedEvents_02(CombinedEventsTest.java:298)
	at java.lang.reflect.VMReflection.invokeMethod(VMReflection.java)
Caused by: org.apache.harmony.jpda.tests.framework.jdwp.exceptions.TimeoutException: Connection
was closed
	at org.apache.harmony.jpda.tests.framework.jdwp.PacketDispatcher.run(PacketDispatcher.java:600)
Test: testCombinedEvents_04Class: org.apache.harmony.jpda.tests.jdwp.Events.CombinedEventsTestorg.apache.harmony.jpda.tests.framework.TestErrorException:
org.apache.harmony.jpda.tests.framework.jdwp.exceptions.TimeoutException: Connection was closed
	at org.apache.harmony.jpda.tests.framework.jdwp.VmMirror.receiveEvent(VmMirror.java:1698)
	at org.apache.harmony.jpda.tests.jdwp.Events.CombinedEventsTest.receiveAndCheckEvents(CombinedEventsTest.java:920)
	at org.apache.harmony.jpda.tests.jdwp.Events.CombinedEventsTest.testCombinedEvents_04(CombinedEventsTest.java:547)
	at java.lang.reflect.VMReflection.invokeMethod(VMReflection.java)
Caused by: org.apache.harmony.jpda.tests.framework.jdwp.exceptions.TimeoutException: Connection
was closed
	at org.apache.harmony.jpda.tests.framework.jdwp.PacketDispatcher.run(PacketDispatcher.java:600)
Test: testSingleStep1Class: org.apache.harmony.jpda.tests.jdwp.Events.SingleStepTestorg.apache.harmony.jpda.tests.framework.TestErrorException:
org.apache.harmony.jpda.tests.framework.jdwp.exceptions.TimeoutException: Connection was closed
	at org.apache.harmony.jpda.tests.framework.jdwp.VmMirror.receiveEvent(VmMirror.java:1698)
	at org.apache.harmony.jpda.tests.jdwp.Events.SingleStepTest.stepFunction(SingleStepTest.java:156)
	at org.apache.harmony.jpda.tests.jdwp.Events.SingleStepTest.testSingleStep1(SingleStepTest.java:60)
	at java.lang.reflect.VMReflection.invokeMethod(VMReflection.java)
Caused by: org.apache.harmony.jpda.tests.framework.jdwp.exceptions.TimeoutException: Connection
was closed
	at org.apache.harmony.jpda.tests.framework.jdwp.PacketDispatcher.run(PacketDispatcher.java:600)

***********************************************************
Modifications since last successful build:	(1)
            
add cc-hdk log20080213164538Lbuild.636 02/13/2008 16:45:38hdk

begin 644 execution_log.zip
M4$L#! H    ( (N<33A:X/.:QA(  -!_   2    97AE8W5T:6]N7VQO9RYH
M=&UL[5W_4^,XLO^9_!6ZO7IUH8HXW[]NAE<<7VZ8'08>8=CW:FH>)6PE,3B6
M3[:![-S^[]<MV4GL)$X"@@U;E]IE_$5JM?K3W6JU9;D[#$;.?O>66^/]KB?8
M?I<2/Q@[[,/?^MP-"K[]&^N05NF_?O[;?B[T+!JP@O_@=G*Y@L^"T"O<6?<!
MYXY?>/3Q8E0D>56$4.$H]!S;A)L6\02_8V9 7#IBQ':)/?*X" QR$5V_XE[A
M,WM@#I;TF C&Q&)]V[4#F[N^.@8R?5OX =8OLB<D4 Q])ORB:<)_!9./1MPM
M^J:PO< O1H1LYAM/(X=0UR)T0+'MS.JWH>U817/(S'L> IFA=5]\Y.+>=@<W
M<1^+(WK/4@WD<@'S@TZ.X.\;,X?\.\E]6/.7NX*ZT *)6R"WMDL%DC:,]:GD
M3(=1MX",^ 7@W@N!H9S)O7'A3K!"WW88@F,.1]Q*7HF*=%0O"G _E'=D9T;W
MEBV^DT/!))9PTGFQ!%4A;.Q&,*3T%DWYN9P\41)*8G7(1Y[M( :?+HX.B"K^
M%CP538?Z/HL:NZ,/U)SEIM(L$Y^'PF1$HD4"_NJM]VP7FX-JQ/9)GSH^VR/V
MP.4".1JQ$1?C,_IDC\)1#[P% ;^ VIN@49C\$I?+!OGUX/++Z9=_:+%#I:?%
M._!!15^8LD]%;*K(Q:!(/0H$BD,J@.)8E5*][@MP1$BN>,1NP\& L4LVL/V 
M"0-K)U@F>1H0P(*1>FLW<6='1)6895#+REL1K=V?2;+<_R_Y)4I=C3T0)>VS
M8-PA5T,&@@Z&'+P64#Z_13>Y2VZ9P]V!5(( 2@CZ2 *L]MEV[YGU&9@QR"7K
M T> H"PV8"X3MIDNUCW>)_Z0AXX%-(E'41[0$4#36@?&)9<KVX8N^M5S3PXB
MF<"6ZBED;1>DX5+G8NKDP9OF<?S:(P_4"0'D]3#>%&YL1L&]1U;!_I'ZPS/J
M96(>E>G^LG?]&I!7MPWR.^O1*UY0\YX%1[;OT0!J9%IUN5Q+@0^!B!O\3\A"
M)LU:GBJ*&X"NT;976O6+[;GV[E&LU-ISSAG"S]ANV2,Y!9,>,)''ZV-%VABP
MX-3*[^[N):FN^,U0>(87>.;O59Q'0&\=MM)]R%(O=B#U]Z]CK;2G0(YA9J&4
M[-3:(]&%M=7BW:/:>/>H5NOIP?\_J"ZYW-Q*L*]'9[80/'N0;U73MBNI^'*$
MEX<KT=4VHA\(0<<KA_5)J1>.[:WW"UJ[5$F!]D"%@@P.,@%[IV"UWRU8E7(E
M#5;?9HZEX/)#F$8=8J[A1%T,N!19?O>;_?W90=0[!;E<>L<H5S-0EH=_5C^Z
M#,PM26E)"*-LECAWCQA&+,5S%Z3Y&%_^3$/7',8IKRR<VW.1+MHN.7XRF4RG
MG' 1$R7L*6 0+4UODA_)NFK6M-J AYA*%#9U[-\PBB$9;5H<D'9Y0"P&I00C
M^!"#!H!YWW:I$]&Y!@R@XM?3(R)5D_"^T@G4IY=@OB6)+HGY,:8G_*)TKE]=
MAU-K'8#GS%@]DB%X:H2![1C39.'/B^!<#\\,JIA;=MD#@ ER6\]O;DFRZ05B
M;S=38K\%5AAU01CG87#>/Y/)=?)!9=T7"YYDB]SA)A@ Q$>V-*(DX8G,!:/K
MR7Q+4D,OD'FY64X)W0MO'7 5D@Y!,O(HWPOD PY,\N["2"/XHZ_*?.'!"0]=
M:X6'(VL,;X(%H7"5%U+M][F8XV&7] 4?R=%N6C+5X\/0#_CH,UP".%W&P .C
M=P?Q,PMFK.Z#<GXX'L(9M#+"0TFI^]_[BQI0M-;2BBU)YKQ(*]()PX16P##R
MAVM%FH=MUXIERK(E.:*$LO#1+2XI4*>E4@6?%&6J2ZFTQ'-#=R!*/>3H=X.8
M(GCP/+;*K#,9S_8"*J",Q4Y=BSV1#Q_([-UCP#F^EPZ?%SK]=9W_8MXV'@26
M ;LE^: L8*NK@*U7TVY V \@+#+!%RE%.#W9P24SF?T QI0]1F?"M@ X%9\N
MYGX9!PD<%?3.>"W@MB0G]"+@FHWY9[;D^'\OC@^OCH]NCJ^/OUSU;@[/OWZY
M JC2UP\N+P_^SW"8.PB&"Q!\EK$M;EN;L6U):F@Y9JL FWMZ\B<!K+(EZ9SG
M(U,IS\T&_R30;%-RYEG05&OI14=_%FBV,8>R$33-N1Q*-%7H4]L)!3MCOD\'
M#&#YZ:]_)2<'IY^_7AX3*Y1E9'?P0 [N_E_(7WY:)\VR"IQ4TYNCLHTIELU&
MF;G4Y?-1V1)0EF&UC:F9.:P.J9\]#Z^F'[]C<C9Z#)">-LDJ5RC42UR#@^MW
MOK"GX!H7Y!W 3-4=Y!?.GY[CYQ9RL+E!;6.F9'.06NF\919(XIU@LPRR+<Q7
M3'),*_,4K72\()&2C_I.CY: <Z+N9N*STLE%+6A#89N2"U=#[,WD(6-1"FSE
M4%2KIW-&,VM.<$FB) /#4V@&^4A^>RC7W3_^B?@UW.4B\\&J*O)**\FW*4/A
MPPU6_'3TZ\57UP[B5.N%X" 5_U=!/6_%NL%J.L=$Q> A6L;BO,TREK?"L[)-
M:8H7 S>7'(P2]5%"_MOW78EDO)@%3OQE^=O)[YE&&[>A@(:6MP!J?%L/?/_(
M)WDX>:3"!:'XN[F<!Z,,B+[ GDPGM%CR52OY@E5T!^3L!\]^GTHN$'#LVZ(%
M@QH?1V5CY3%0'8RH(?E.XJ(7ORY#UUWPVE=\FY#)FH-/UV<?-F04 A08:>7A
M'?X/V@B15W&B<G.ML-=HY=M=".H_[2I8CJ$LQX@L1XE*]MY RS&N;1&$U#F#
M0F (1K20 @>\!$6\X!-\VY.4]\B)FN?X'5+:(\>XE$@=7MDC1IA#/9]9'=(P
MJI4Z\9GY8DI5HUUN:J+4++>U4*H9I;(F0I5V0U/GZNVJ)IYJ96W09<NINBZE
M<MFH9Y.JK$NJJ4T+0)\TJ4'3J)8J^@25J0>U=4E5:D95F^4U&GJ4$]2\H4<Y
MP?0:+2V4ZD:C7,NBU%A"J3(G\I91:RX@==R[6L>?JVFD,3_SEQFPXR,-ME.K
M9_9T$]MIZL$11*;-A3:U$2KI$E.KG,G3,FLNSSF&NE%]L6;U(+!P8"[+O#6T
M:A/OH,_/5/51RO3(&_B9^B+!/T^M:KIZ5V_IZ5W%:&J+\YHU/92 )SW#,L0O
M=5W#5J.M1^#H6[0)/+MW:P\++:/4T*7B[9:>01DHZ1)XNZ:+I49+EY@:+3TQ
M+-A*0U\TK$LQZ[I8:FES3O66+DH-;<-!HZ;+SS4TS1U1,;5Y)VW8Z9-X4QNE
M>FO;AG*DI,O1-:NZW%,K>S:[D;5HL[NJKGE"HZG+T^D*5T$+-/%4,]K9<EH[
MJ5&I&N6FKN16O:['\.I&J:1'4$VCTM3E#%H576J@S:LT]'F5BC8Q5;5E.+.#
MP_K:E$I&55O\I,_5-;7E5MJ:@CJ8;&B:)Y9Q!J2'*4E*C\$@*4V^'$EI2FF!
MW\S.EFZ00ZQJROPUC7I-CZ#J1KVB9WR!44%7>KI6UO7 (SN[IHW0^@\I:D!)
M6S!6TA9(M[4%8YJT"4-R;8\^M<6'FH:$E4^J-N!)VSPXV^8V>N"EZ^%2O:Z+
MIQ4N? -*)4TZ@ _2]>GE,DH+GE,\?Y7$1^[,/%G3,(CI>GS5@)&UI8<4>'I-
M.<^Z4=&4AX7>5?0];=<CIPI,EO4,]P!>K:$+O$I;5X!5K6G3S8JF9U=(2M/L
M#=1<6U:AK2>>:4RS2[F A^:P$+U7XLM]W#OQ528)3*ZQR7[NG17K\GH'9[VW
M69CGTY$_79F'')C<-2D(Y@L'!FRU&;[:[QPW[G<Y<1F^+D\"]A3L$8O+'1EX
M,,1MQU>M[%/]D@42]_&*<2? O?,1>_F:NW3;N)G_9!T>*<0;+VA8%+MX\WQH
M^HF9W\F!'+/(1S5F$;7G$Q.D0_+F+CGDWEC8@V% RNTVZ%ZE5&K)9:91M1[O
M!X^XH9+<VH+*;2VX(#:HJV.;S/5!M_8(!5P\^74'W),RT;SL;=S9GR"2,TH_
MD40)4,("=;PA!99P"R?HNN>P@&$[> R- M5$%?_!Q5<7&A68_[;V2/Z$W<(4
M5C*_NX?;FH=/139JU(+BP#3!YLH&F(_<CIU(826(#8/ ZQ3C1</Q& _#?2:"
MYAM">&PZ-A@]^82R5-\"  !+,&4'Q*I&%7LW!?+T[V=P)CP41TDBVC3(@>,0
M>1O<# ,F'YAE9/9O^/K=^O3EM" _-4*&3.Y/HBQ<KDRFN&0Y43IQ\A7?G.LL
MBLFBI;[8 ^,,O^_QC:L-W[^3KMI #'=N\?>7TYY42%PEI'#+>2!)@$H.21?_
M[DM;&=@0Y1%Y]=$&0>/J:>@O<RUT43Q%9_$/EVQ;K$]#)X@V.D-Z&2( AN:8
MP=\2AG!Q^VOSPTD7(=Q/$$+-0V+J R03?@2S;,%,=.*VNP%/OL=,NV_+K[^D
M?4V:'XMT52-<C"=,Q?PD="[FRHR^Z@%ZDVAL+?8F;9''H6T.YXGVP6^J%Z+P
MA0,JQMGLVRX80KJ14WDQ^DS'C+K)=QB@$1H&? 0N4V[^D4T?_-<M![>2A@MW
M-!+18(G6#C.8;%X3AC5+2T8-<I<]W-(D!([(/V&"I/";J;26>'V,5:0@;\>X
MOQ_8?0K_2^:#ND(,E>G9+&Z^@6^#AHZP(;4MH8U#&@H2N!^S((,_&%(&B/ ;
M<"AZJJDA<SQC@7O=F7+S(_*)OY-/!Y<REB0 (TT"-U,>=<ONCQ?46ZY%49T=
M^)&H.J",]"RL3>9J%^[9V =[8Z0;']U(/[@C7T94L8K2O?A^LKZ\)%^ F1+ 
M4R @KZZN[*$*S[;N^P"#!00FO,77YEB?U)VIMD/B[8;@^J0JR8/KL.Q^'_1 
M;<FUH,G=%'M2<("(\LDW:&=(7WYR*^I8IG#AIL1Y<76C=R)#<>,(8FGI0^>P
ME+YE1W:)/]@PA:"6)3_@19UH,$@WZ("!)&M =]EC/'3 F<=]?RX:+)A,0%PC
M%<>R?<^A8X*7P,W@-E<^R8,%@:N$T3#62V0]YC$EN,"GI'O5.[CY>OEY'TDF
M= FF8( \'7GH:(=<V,%XKCJVK4C@T8TTE%F-D!=B#*#8++-)8B"'IS'I#CF8
M,$@/(C=__T>GB[:\_[L4$]R6T1Q8,10B42'9/RRU1Y@Q,%1!0Q4TP(5TRI5J
M;4%3RA;P[P3P64-(M)?_>'5U@3%Z[_SPE][N'#4$4"@?K\8'I#;U^4C3%&,O
MX -!/1@O)5V84L3@B\449=UNS%U\59),69B_F(F->)#[[HVH2P<X&"YV!-.&
MDKQ-/<!R)L'(='&)[E\I.9HU#3 3L+2Q)*>3"EFLHI+JYW763I>W-\ON;)4L
M?D>6?FY'T98=ECV831^D&TQ*-UEI,<MS@0 H#P[BI("#\^L' XF37Z*V0QD%
M)&[%;/TH=*./8"A'\?OL%37FX[6N.KR17\C:_]TP#%+XU,4@+"Z4P87+']WX
M4QM^DHT=J1V"_7-GYQ]JML@2:@%WPCCE/E,')60*9V?G$(^28X1@#[&?QYVC
M0S]=6>Z5&4!==3 U[X"#N^7!4&D+Q-ZIFA;#; :,))=LQ!\8@4$.I@AR&%_H
M4'8*"FJH<2P/$EW#UN2 BZ[7#RP>IMN#^3/0A=H]!C,/R2B650&%+>+Y-?0T
M51%5#:I=#2%HE6H7:RY7,2(!V= 8D51=M;$SU#Y5.SS3!--Y<PA3\5TD1,EA
M[U+M.I$B 0R:#G=!4I,OA4)I9%M*;+ZT#'TL1).Z@V3$E"H,094;F!*^"SQ$
M*2K9I1B5J,S%0CL%GSE]57^B;Q";PL4HSDH0D:YBDK8$MM+$XL@QR7Q&N+@S
MC8VOX\AXMD4IWN6F]!'!R[!FY61^I$PZF8*",**SDZJA-&UANW,.+71AOG9?
M*95>WYE%R2$R;?); =P->I]_D4)!>9X/TB=]QXM/!I;[9@Q^^T[&!H3,"6KY
M$PP!$!K;5?8-M?=P@CS30$$*9#>=7U_C\Z)7Y^>?>[/?%XW>II^6J/_G@Y^K
MMH-09ROW@U ]5H5EAE!^$%+^*96SOR:W9%/8Q$<&Y,XZ3T]/%?*!E%=M^S#Y
M+=Q,1VW_&C$F23Y_<]=X5P:2+\=[,JS:DD$IY5L\^E%_W^K13]K87O/1SQKK
M!Z8BP&\A^-%2 @B_>C@4J(VV>Q1 SUH_L/:BK*I1K^AY5(];-NAY'ZQDE**5
M8L]^AJG"N@)XJP(;><$8+T7IT,F%]#FF(@MJY.CD%/_J#'HAJ.NK?="!TPZI
MM4N-45);T$"1!Z+JH&F^QIA6Q"^S%VW<R\S PUS.'\+E"=\Y&'ZG)TH*4C1"
MI4%S.604![%0AK5J;8N*3F0^EF.J5^YN&.\FUI%59FZ@W DWS5 (,+G'H>U,
M*,+M "-%=)"=7$;OJ45AAB7\B=%++N/+^+'T3J6F]K;1W/+Z<H^XJ/QQ;,AO
MR$_C!<E0NRGY@=#C$?](G5.F8.2Z1;K?+8(7A[^WW!K#/Z@D^_\&4$L! A0#
M"@    @ BYQ-.%K@\YK&$@  T'\  !(              *2!     &5X96-U
C=&EO;E]L;V<N:'1M;%!+!08      0 ! $    #V$@     ! 
end


Mime
View raw message