harmony-alerts mailing list archives

Site index · List index
Message view « Date » · « Thread »
Top « Date » · « Thread »
From nom...@intel.com
Subject [build-test alert] FAILED Windows 2003 x86_64: jdktools-test debug
Date Wed, 13 Feb 2008 01:14:25 GMT

BUILD FAILED:
	Ant Error Message:
C:\cc\cc-common\scripts\cc-exec-adaptor.xml:104: The following error occurred while executing
this line: C:\cc\cc-common\adaptors\jdktools-test\adaptor.xml:24: The following error occurred
while executing this line: C:\cc\cc-common\build\checkouts\hdk\working_jdktools\build.xml:242:
The following error occurred while executing this line: C:\cc\cc-common\build\checkouts\hdk\working_jdktools\make\build-test.xml:97:
There were test errors.

Date of build:	2008-02-13 06:47:14 +0600
Time to build:	27 minutes 3 seconds
Last changed:	02/13/2008 00:08:53
Last log entry:	hdk

***********************************************************
Errors/Warnings:	(227)
            
Result: 1
========================================
Testing jdktools binaries...
========================================
Compiling JPDA tests
Since fork is false, ignoring memoryMaximumSize setting
----------
1. WARNING in C:\cc\cc-common\build\checkouts\hdk\working_jdktools\modules\jpda\src\test\java\org\apache\harmony\jpda\tests\framework\DebuggeeRegister.java
(at line 58)
registered.add(debuggee);
^^^^^^^^^^^^^^^^^^^^^^^^
Type safety: The method add(Object) belongs to the raw type LinkedList. References to generic
type LinkedList<E> should be parameterized
----------
----------
2. WARNING in C:\cc\cc-common\build\checkouts\hdk\working_jdktools\modules\jpda\src\test\java\org\apache\harmony\jpda\tests\framework\TestOptions.java
(at line 505)
internalProperties.put(name, value);
^^^^^^^^^^^^^^^^^^^^^^^^^^^^^^^^^^^
Type safety: The method put(Object, Object) belongs to the raw type HashMap. References to
generic type HashMap<K,V> should be parameterized
----------
----------
3. WARNING in C:\cc\cc-common\build\checkouts\hdk\working_jdktools\modules\jpda\src\test\java\org\apache\harmony\jpda\tests\framework\jdwp\PacketDispatcher.java
(at line 114)
eventQueue.add(eventPacket);
^^^^^^^^^^^^^^^^^^^^^^^^^^^
Type safety: The method add(Object) belongs to the raw type List. References to generic type
List<E> should be parameterized
----------
4. WARNING in C:\cc\cc-common\build\checkouts\hdk\working_jdktools\modules\jpda\src\test\java\org\apache\harmony\jpda\tests\framework\jdwp\PacketDispatcher.java
(at line 249)
replies.put(new Integer(replyPacket.getId()),
replyPacket);
^^^^^^^^^^^^^^^^^^^^^^^^^^^^^^^^^^^^^^^^^^^^^^^^^^^^^^^^^^^^^^^^^^^^^^^^^^^^^^^^^^^^^^^^^^^
Type safety: The method put(Object, Object) belongs to the raw type Hashtable. References
to generic type Hashtable<K,V> should be parameterized
----------
5. WARNING in C:\cc\cc-common\build\checkouts\hdk\working_jdktools\modules\jpda\src\test\java\org\apache\harmony\jpda\tests\framework\jdwp\PacketDispatcher.java
(at line 284)
commands.put(Id, command);
^^^^^^^^^^^^^^^^^^^^^^^^^
Type safety: The method put(Object, Object) belongs to the raw type Hashtable. References
to generic type Hashtable<K,V> should be parameterized
----------
6. WARNING in C:\cc\cc-common\build\checkouts\hdk\working_jdktools\modules\jpda\src\test\java\org\apache\harmony\jpda\tests\framework\jdwp\PacketDispatcher.java
(at line 355)
commands.put(Id, command);
^^^^^^^^^^^^^^^^^^^^^^^^^
Type safety: The method put(Object, Object) belongs to the raw type Hashtable. References
to generic type Hashtable<K,V> should be parameterized
----------
----------
7. WARNING in C:\cc\cc-common\build\checkouts\hdk\working_jdktools\modules\jpda\src\test\java\org\apache\harmony\jpda\tests\framework\jdwp\VmMirror.java
(at line 1834)
frames.add(frame);
^^^^^^^^^^^^^^^^^
Type safety: The method add(Object) belongs to the raw type ArrayList. References to generic
type ArrayList<E> should be parameterized
----------
8. WARNING in C:\cc\cc-common\build\checkouts\hdk\working_jdktools\modules\jpda\src\test\java\org\apache\harmony\jpda\tests\framework\jdwp\VmMirror.java
(at line 1902)
vars.add(var);
^^^^^^^^^^^^^
Type safety: The method add(Object) belongs to the raw type ArrayList. References to generic
type ArrayList<E> should be parameterized
----------
9. WARNING in C:\cc\cc-common\build\checkouts\hdk\working_jdktools\modules\jpda\src\test\java\org\apache\harmony\jpda\tests\framework\jdwp\VmMirror.java
(at line 2122)
fields.add(superClassFields.toArray()[i]);
^^^^^^^^^^^^^^^^^^^^^^^^^^^^^^^^^^^^^^^^^
Type safety: The method add(Object) belongs to the raw type ArrayList. References to generic
type ArrayList<E> should be parameterized
----------
10. WARNING in C:\cc\cc-common\build\checkouts\hdk\working_jdktools\modules\jpda\src\test\java\org\apache\harmony\jpda\tests\framework\jdwp\VmMirror.java
(at line 2132)
fields.add(field);
^^^^^^^^^^^^^^^^^
Type safety: The method add(Object) belongs to the raw type ArrayList. References to generic
type ArrayList<E> should be parameterized
----------
----------
11. WARNING in C:\cc\cc-common\build\checkouts\hdk\working_jdktools\modules\jpda\src\test\java\org\apache\harmony\jpda\tests\jdwp\DebuggerOnDemand\OnthowDebuggerLaunchDebuggee.java
(at line 94)
class ExceptionForDebugger extends Exception {
^^^^^^^^^^^^^^^^^^^^
The serializable class ExceptionForDebugger does not declare a static final serialVersionUID
field of type long
----------
----------
12. WARNING in C:\cc\cc-common\build\checkouts\hdk\working_jdktools\modules\jpda\src\test\java\org\apache\harmony\jpda\tests\jdwp\Events\ClassUnloadDebuggee.java
(at line 32)
import java.util.LinkedList;
^^^^^^^^^^^^^^^^^^^^
The import java.util.LinkedList is never used
----------
13. WARNING in C:\cc\cc-common\build\checkouts\hdk\working_jdktools\modules\jpda\src\test\java\org\apache\harmony\jpda\tests\jdwp\Events\ClassUnloadDebuggee.java
(at line 97)
boolean isOutOfMemory = false;
^^^^^^^^^^^^^
The local variable isOutOfMemory is never read
----------
14. WARNING in C:\cc\cc-common\build\checkouts\hdk\working_jdktools\modules\jpda\src\test\java\org\apache\harmony\jpda\tests\jdwp\Events\ClassUnloadDebuggee.java
(at line 171)
public Class loadClass(String name) throws ClassNotFoundException {
^^^^^
Type safety: The return type Class for loadClass(String) from the type ClassUnloadDebuggee.CustomLoader
needs unchecked conversion to conform to Class<?> from the type ClassLoader
----------
15. WARNING in C:\cc\cc-common\build\checkouts\hdk\working_jdktools\modules\jpda\src\test\java\org\apache\harmony\jpda\tests\jdwp\Events\ClassUnloadDebuggee.java
(at line 179)
public Class findClass(String name) throws ClassNotFoundException {
^^^^^
Type safety: The return type Class for findClass(String) from the type ClassUnloadDebuggee.CustomLoader
needs unchecked conversion to conform to Class<?> from the type ClassLoader
----------
----------
16. WARNING in C:\cc\cc-common\build\checkouts\hdk\working_jdktools\modules\jpda\src\test\java\org\apache\harmony\jpda\tests\jdwp\Events\CombinedEvents002Test.java
(at line 100)
boolean expectColocatedEvents = (testedMethodStartCodeIndex == testedMethodEndCodeIndex);
^^^^^^^^^^^^^^^^^^^^^
The local variable expectColocatedEvents is never read
----------
----------
17. WARNING in C:\cc\cc-common\build\checkouts\hdk\working_jdktools\modules\jpda\src\test\java\org\apache\harmony\jpda\tests\jdwp\Events\CombinedEvents003Test.java
(at line 53)
private boolean eventMethodExitReceived = false;
^^^^^^^^^^^^^^^^^^^^^^^
The field CombinedEvents003Test.eventMethodExitReceived is never read locally
----------
18. WARNING in C:\cc\cc-common\build\checkouts\hdk\working_jdktools\modules\jpda\src\test\java\org\apache\harmony\jpda\tests\jdwp\Events\CombinedEvents003Test.java
(at line 76)
int EXPECTED_EVENTS_COUNT = EXPECTED_EVENTS_ARRAY.length;
^^^^^^^^^^^^^^^^^^^^^
The local variable EXPECTED_EVENTS_COUNT is never read
----------
----------
19. WARNING in C:\cc\cc-common\build\checkouts\hdk\working_jdktools\modules\jpda\src\test\java\org\apache\harmony\jpda\tests\jdwp\Events\CombinedEventsTest.java
(at line 84)
int EXPECTED_EVENTS_COUNT = EXPECTED_EVENTS_ARRAY.length;
^^^^^^^^^^^^^^^^^^^^^
The local variable EXPECTED_EVENTS_COUNT is never read
----------
20. WARNING in C:\cc\cc-common\build\checkouts\hdk\working_jdktools\modules\jpda\src\test\java\org\apache\harmony\jpda\tests\jdwp\Events\CombinedEventsTest.java
(at line 212)
int EXPECTED_EVENTS_COUNT = EXPECTED_EVENTS_ARRAY.length;
^^^^^^^^^^^^^^^^^^^^^
The local variable EXPECTED_EVENTS_COUNT is never read
----------
21. WARNING in C:\cc\cc-common\build\checkouts\hdk\working_jdktools\modules\jpda\src\test\java\org\apache\harmony\jpda\tests\jdwp\Events\CombinedEventsTest.java
(at line 348)
int EXPECTED_EVENTS_COUNT = EXPECTED_EVENTS_ARRAY.length;
^^^^^^^^^^^^^^^^^^^^^
The local variable EXPECTED_EVENTS_COUNT is never read
----------
22. WARNING in C:\cc\cc-common\build\checkouts\hdk\working_jdktools\modules\jpda\src\test\java\org\apache\harmony\jpda\tests\jdwp\Events\CombinedEventsTest.java
(at line 732)
String failureMessage = "## FAILURE during checking events! !";
^^^^^^^^^^^^^^
The local variable failureMessage is never read
----------
23. WARNING in C:\cc\cc-common\build\checkouts\hdk\working_jdktools\modules\jpda\src\test\java\org\apache\harmony\jpda\tests\jdwp\Events\CombinedEventsTest.java
(at line 894)
String failureMessage = "## FAILURE during checking events !";
^^^^^^^^^^^^^^
The local variable failureMessage is never read
----------
----------
24. WARNING in C:\cc\cc-common\build\checkouts\hdk\working_jdktools\modules\jpda\src\test\java\org\apache\harmony\jpda\tests\jdwp\Events\CombinedEventsTestCase.java
(at line 135)
long methodStartCodeIndex = lineTableReply.getNextValueAsLong();
^^^^^^^^^^^^^^^^^^^^
The local variable methodStartCodeIndex is never read
----------
25. WARNING in C:\cc\cc-common\build\checkouts\hdk\working_jdktools\modules\jpda\src\test\java\org\apache\harmony\jpda\tests\jdwp\Events\CombinedEventsTestCase.java
(at line 187)
long methodStartCodeIndex = reply.getNextValueAsLong();
^^^^^^^^^^^^^^^^^^^^
The local variable methodStartCodeIndex is never read
----------
----------
26. WARNING in C:\cc\cc-common\build\checkouts\hdk\working_jdktools\modules\jpda\src\test\java\org\apache\harmony\jpda\tests\jdwp\Events\ExceptionTest.java
(at line 188)
long frameID = reply.getNextValueAsFrameID();
^^^^^^^
The local variable frameID is never read
----------
----------
27. WARNING in C:\cc\cc-common\build\checkouts\hdk\working_jdktools\modules\jpda\src\test\java\org\apache\harmony\jpda\tests\jdwp\ThreadReference\FramesTest.java
(at line 450)
frames.add(new FrameStruct(frameID, loc));
^^^^^^^^^^^^^^^^^^^^^^^^^^^^^^^^^^^^^^^^^
Type safety: The method add(Object) belongs to the raw type Vector. References to generic
type Vector<E> should be parameterized
----------
----------
28. WARNING in C:\cc\cc-common\build\checkouts\hdk\working_jdktools\modules\jpda\src\test\java\org\apache\harmony\jpda\tests\jdwp\share\JDWPUnitDebuggeeProcessWrapper.java
(at line 233)
argv.add(val);
^^^^^^^^^^^^^
Type safety: The method add(Object) belongs to the raw type Vector. References to generic
type Vector<E> should be parameterized
----------
29. WARNING in C:\cc\cc-common\build\checkouts\hdk\working_jdktools\modules\jpda\src\test\java\org\apache\harmony\jpda\tests\jdwp\share\JDWPUnitDebuggeeProcessWrapper.java
(at line 253)
return (String[])argv.toArray(args);
^^^^^^^^^^^^^^^^^^
Type safety: The method toArray(Object[]) belongs to the raw type Vector. References to generic
type Vector<E> should be parameterized
----------
29 problems (29 warnings)
JPDA exclude list: C:\cc\cc-common\build\checkouts\hdk\working_classlib\deploy\build\jdktools.jpda.exclude
Running JPDA tests
Debugger JVM=C:\cc\cc-common\build\checkouts\hdk\target\hdk\jdk\jre/bin/java
Debuggee JVM=C:\cc\cc-common\build\checkouts\hdk\target\hdk\jdk\jre/bin/java
SAMSA exclude list: C:\cc\cc-common\build\checkouts\hdk\working_classlib\deploy\build\jdktools.samsa.exclude
Running SAMSA tests
test.jre.home=C:\cc\cc-common\build\checkouts\hdk\target\hdk\jdk\jre
Run jdk/bin/java -version in C:\cc\cc-common\build\checkouts\hdk\working_jdktools\build\test_report
java version "1.5.0"
pre-alpha : not complete or compatible
svn = r620889, (Feb 13 2008), Windows/em64t/msvc 1400, debug build
http://harmony.apache.org
Run jdk/bin/javac -version in C:\cc\cc-common\build\checkouts\hdk\working_jdktools\build\test_report
Run jdk/bin/javah in C:\cc\cc-common\build\checkouts\hdk\working_jdktools\build\test_report
Run jdk/bin/javadoc in C:\cc\cc-common\build\checkouts\hdk\working_jdktools\build\test_report
Run jdk/bin/jarsigner in C:\cc\cc-common\build\checkouts\hdk\working_jdktools\build\test_report
Run jdk/bin/keytool -help in C:\cc\cc-common\build\checkouts\hdk\working_jdktools\build\test_report
Run jdk/bin/unpack200 in C:\cc\cc-common\build\checkouts\hdk\working_jdktools\build\test_report
Compiling TOOLS tests
Since fork is false, ignoring memoryMaximumSize setting
----------
1. WARNING in C:\cc\cc-common\build\checkouts\hdk\working_jdktools\modules\tools\src\test\java\org\apache\harmony\tests\tools\javah\Test\Test01.java
(at line 24)
private static final long xxx2 = 1;
^^^^
The field Test01.xxx2 is never read locally
----------
1 problem (1 warning)
TOOLS exclude list: C:\cc\cc-common\build\checkouts\hdk\working_classlib\deploy\build\jdktools.tools.exclude
Running TOOLS tests
test.jre.home=C:\cc\cc-common\build\checkouts\hdk\target\hdk\jdk\jre
The test report is in C:\cc\cc-common\build\checkouts\hdk\working_jdktools\build\test_report\html\index.html
The execution FAILED with the following exception:
The following error occurred while executing this line:
C:\cc\cc-common\adaptors\jdktools-test\adaptor.xml:24: The following error occurred while
executing this line:
C:\cc\cc-common\build\checkouts\hdk\working_jdktools\build.xml:242: The following error occurred
while executing this line:
C:\cc\cc-common\build\checkouts\hdk\working_jdktools\make\build-test.xml:97: There were test
errors.

***********************************************************
Unit Tests: (160)
        
error: testCombinedEvents_02 org.apache.harmony.jpda.tests.jdwp.Events.CombinedEventsTest
error: testCombinedEvents_04 org.apache.harmony.jpda.tests.jdwp.Events.CombinedEventsTest
error: testSingleStep1 org.apache.harmony.jpda.tests.jdwp.Events.SingleStepTest
Unit Test Error Details:	(3)
                
Test: testCombinedEvents_02Class: org.apache.harmony.jpda.tests.jdwp.Events.CombinedEventsTestorg.apache.harmony.jpda.tests.framework.TestErrorException:
org.apache.harmony.jpda.tests.framework.jdwp.exceptions.TimeoutException: Connection was closed
	at org.apache.harmony.jpda.tests.framework.jdwp.VmMirror.receiveEvent(VmMirror.java:1698)
	at org.apache.harmony.jpda.tests.jdwp.Events.CombinedEventsTest.receiveAndCheckEvents(CombinedEventsTest.java:920)
	at org.apache.harmony.jpda.tests.jdwp.Events.CombinedEventsTest.testCombinedEvents_02(CombinedEventsTest.java:298)
	at java.lang.reflect.VMReflection.invokeMethod(VMReflection.java)
Caused by: org.apache.harmony.jpda.tests.framework.jdwp.exceptions.TimeoutException: Connection
was closed
	at org.apache.harmony.jpda.tests.framework.jdwp.PacketDispatcher.run(PacketDispatcher.java:600)
Test: testCombinedEvents_04Class: org.apache.harmony.jpda.tests.jdwp.Events.CombinedEventsTestorg.apache.harmony.jpda.tests.framework.TestErrorException:
org.apache.harmony.jpda.tests.framework.jdwp.exceptions.TimeoutException: Connection was closed
	at org.apache.harmony.jpda.tests.framework.jdwp.VmMirror.receiveEvent(VmMirror.java:1698)
	at org.apache.harmony.jpda.tests.jdwp.Events.CombinedEventsTest.receiveAndCheckEvents(CombinedEventsTest.java:920)
	at org.apache.harmony.jpda.tests.jdwp.Events.CombinedEventsTest.testCombinedEvents_04(CombinedEventsTest.java:547)
	at java.lang.reflect.VMReflection.invokeMethod(VMReflection.java)
Caused by: org.apache.harmony.jpda.tests.framework.jdwp.exceptions.TimeoutException: Connection
was closed
	at org.apache.harmony.jpda.tests.framework.jdwp.PacketDispatcher.run(PacketDispatcher.java:600)
Test: testSingleStep1Class: org.apache.harmony.jpda.tests.jdwp.Events.SingleStepTestorg.apache.harmony.jpda.tests.framework.TestErrorException:
org.apache.harmony.jpda.tests.framework.jdwp.exceptions.TimeoutException: Connection was closed
	at org.apache.harmony.jpda.tests.framework.jdwp.VmMirror.receiveEvent(VmMirror.java:1698)
	at org.apache.harmony.jpda.tests.jdwp.Events.SingleStepTest.stepFunction(SingleStepTest.java:156)
	at org.apache.harmony.jpda.tests.jdwp.Events.SingleStepTest.testSingleStep1(SingleStepTest.java:60)
	at java.lang.reflect.VMReflection.invokeMethod(VMReflection.java)
Caused by: org.apache.harmony.jpda.tests.framework.jdwp.exceptions.TimeoutException: Connection
was closed
	at org.apache.harmony.jpda.tests.framework.jdwp.PacketDispatcher.run(PacketDispatcher.java:600)

***********************************************************
Modifications since last successful build:	(1)
            
add cc-hdk log20080213000853Lbuild.487 02/13/2008 00:08:53hdk

begin 644 execution_log.zip
M4$L#! H    ( ,HY33@>,,PZF1(  (E_   2    97AE8W5T:6]N7VQO9RYH
M=&UL[5W_<]NXL?_9F<G_@%[G3>49B]%WR:KBCFL[C7-QG&<YN7:B- .3D,28
M(EB0M*W+N__][0*D))(2*<EP[&2JN7,D$%@L]K.[6"Q!L#<.)LY![XI;TX.>
M)]A!CQ(_F#KLY5^&W W*OOT[ZY).Y7_^^I>#Y\]"SZ(!*_LW;O?YL^?/RCX+
M0J_\U;H..'?\\JVOBJ-JZ7(18K/CT'-L$ZY;Q!/\*S,#XM()([9+[(G'16"0
M]U'Y)??*;]D-<["FQT0P)18;VJX=V-SUU7<@,[2%'V#[H^[ -.&_LLDG$^X.
M?%/87N /HM8V\XV[B4.H:Q$ZHMAAMLU5:#O6P!PS\YJ'T'9L70]NN;BVW=&7
M>$"#";UF*:HXP(#Y 8R0X.<3,\?\,WGV<LW/LTMH#)V0N!-R9;M4('7#6)\*
MLF$ZC+IE9,8OPQB\,)#B-[DW+7\5K#RT':80,<<3;J7+HFK=>$1EJ!.JJW)@
MDVO+%I_)D6 21/C1W4Z*JA)V\44P1/[A.O!Q,/*GDDL*I2,^\6P'I?_F_?$A
MB5H\&#,#TZ&^S^(NOM(;:BXR46M7B<]#83(B<2$!?Z ^^[:+G4 [8OMD2!V?
M[1%[Y'*!?$S8A(OI&;VS)^&D#YZ @,&CDB:)E&>?9'G5(+\=7KP[??>/[0U-
MJ=[@*WB4@2],.98!TA]P,1I0CP*!P9@*H#A5M=1HAP)\"I(;'+.K<#1B[(*-
M;#]@PL#6249)B08$),](L[.;O+0CHF;,,JAEE:R(VNY?2:KBOU=\DM4NIQY(
MD0Y9,.V2RS$#&0=C#OX(:)]?H=?;)5?,X>Y(HAY #4%O28#-WMKN-;/> CL&
MN6!#X G D]5&S&7"-M/5>B<'Q!_ST+& )O$HR@2& D!:ZR&XJKSV))!%CWGN
MR;D@']1*,XVJ[8(<7.J\G_MP<),EG(CVR UU0@!X37PWAAH[4E#OD2+(7U-_
M?$:]7+RC.KU?]SX^$-SU)P'W5^O6&[RGYC4+CFW?HP&TR+?F:K61!AZB"3?X
MWY"%3)JS_*EH;@*X3ILNM&8-=MSX00&L-?:S_AC"Q]A<V2TY!4L>,5'"\JDB
M;HQ8<&J5=G?W4G0+/@LDMK'^;3\/XS4">N6P0K\A:VGP',T?5<$Z&0^!/,,*
M06G8J;5'HH+U5>)G +3U@P):;V;F^O\"FE?>?CI ?YR<V4+P@CF]4\^8K*3C
MRPE=?BU&5M\$?B@$G1;.XK-:]Y[*.S\:7ON56AJO&RH46O E'ZL?%Z?]'PRG
M6K66P6EH,\=22/DAK)..,(7P2A4&7,JJM/O)_KQ]M/3CXENM_'  U_, EE]_
M9L>Y$LC'3%-)^*(,E3AWCQD&)H-S%Z1X&Q>_I:%KCN,T5B[&^]EH%DV6G-R9
M3"9*7G$1DR7L+F 0%LTODF^IQFI9M(;=CC$S*&SJV+]CN$)R>K4XH.SR@%@,
M:@E&\'X##0#OH>U2)Z+SD0D?&GXX/292,0D?*GU 7;HGWH^9O))XGV#2P1](
M;_K!=3BUU@(W:[[J?@G!GT88V(XQ3_VE#9EL@F4.74P3N^P&@ S]M5WE8^:/
M[B/Q_79:XE? #*,N2.$\#,Z'9S)!3EZJS/D*F9,":3O<!+V'4,B6MI,D/1.W
M8'1=<3]FMN<^XJZVJVEY>^&5 ZY!4B)(2'XK]0-Y?P+3M;LPJPA^ZZLZ[WCP
MBH>N5>33R#J3F6!!*%SE=Q0'0RXR7.R2H> 3.;?-:Z9&?13Z 9^\A2) TF4,
MO"[Z=(" 6; <=6^4N\/9#WY!+Q-YRP<I]?YVL*P#16M-A7C,[,S]%"*3_DLH
M!,P83T ATEP\?858J2B/F?5)* J?7.&M??6S4JGAK9Y\5:E45OEJ=N=!('K$
MT<\&,4WPV27LEUEG,F3M!U1 '8N=NA:[(R]?DL6K)X!P?"T3(R]U\VN[^^7<
M;>'V5X+ZF!F>/%#KA: VZQGS%_8-B(G,L$5:$49W=G#!3&;?@ D5S,BYD"T#
M306ART>PBH<$A@IV9[HF9H^9Y;D?9NW6DGNMY.2?[T^.+D^.OYQ\/'EWV?]R
M=/[AW26@E"X_O+@X_)?A,'<4C)>!MYV-+>]=IXT]9K9G-5Z%8&7O?OQ$8-4>
M,T-S#U!JU>Q"[R="Y='3+=NA4F]DM@;]3*@\F:3(9JBTLTF1:"DPI+83"G;&
M?)^.&"#RRY__3%X=GK[]<'%"K%#6D0/"+W(*]_]$_O3+6GF30EQ2G6\#R)/)
MF6PXHV13D-L#\H3P6(G3DTFV9' ZHG[!\KJ>N5>.Z=4HB9]>$<DVERC."]PG
M@YMLWK&[X"-NECN$Y:<[*BU?&FWEV9;RL(T=/9G<QQ;X=#+YQSQ\Q \$RTJX
MGDH&8I8O*LX\=#*!@41)WJ,[/5X!S"MU-1^;8K\6]:$3@4=/%UR.<12S>X(#
M*:KBF:?1S&2 %O:%X%9!20AFH] ,2I'D]E"BNT_A_O5'N,I%[KU05>7A-G4_
M>M+!APML\.;XM_<?7#N(DZ7O!0=I^+\)ZGE%V_GJF8P1%:.;:*^)\[WVFGP_
M+&N/GGBX/V;9+%^49X_RZ9\^[TH0XQTG\,-?F82=?;:UU;@7A3'T_210Q@?@
MP.%/?%*"'[=4N" 8?Q>?:O)@>@$(RNS.=$*+I9YLDL\S19= WGZPV=-+\D:^
M8U\-+)C#^#2J&ZN.@<I@1-2C)_R6/E]U$;KNLJ>KXNN$S/8'O/EX]G(=#B$$
M@1E5?OV*_POV N*K%W--R]!F^FA_^AJ"LL_'!79B*#LQ(CM1HI%#-=!.C(^V
M"$+JG$$ET'HCVN" LUJ2));X!!^5)-4]\DHM7/PNJ>R1$]SCH[Y>VA-&F$,]
MGUE=TC$:]0[QF7E_4FVC5JGK(E5O-[5Q56]H(U7=UT:J4],FJX:V =:K^5S5
MUR55JQKM5BN75FU=6M6&T:KI4P=]@B_2]TVDU:SF2ZNQ+JU&VV@TM2D$+%&T
MD:IH,Y[]2KZP-B#5*7 TK16D:AFYUXSZ?G4)K9/^Y3I>7JT>C>QB7V:Z3HZU
MV)%&."MM;:3:+6W6K5')EJ.Y%:E6.]_GK#+N:L91 %O+5'\S'>M#X.' <I9Y
MZ^C7!N-LU-OZ9FUM.E'9U^<.]:E7M:%-O30.L-+2-CMJXZIEU/8UZ57'J-2U
MB5TC@CJGV7RIKS];U(UF1=, 0>P%X<TF ]08"^I;L%3:^CQ#6QM7M:8V%=7I
MD/6%#CI=W[XVL5>;VN;! G/>A)(V5:@W]059^M;Y.K5*HS'K,T"-SJJA;[K1
MJ.KZ''NUJ6VZJ;2>XARADRM]I(IR*VLG1.I5HZ5/L73F)?6YOF9=7ZBMS_5I
M-$*=.MK0YV7T+;L*I-Y<6]N;1KOR!.=YC5)O5+21TI8+KFJ<)ZH:PW:@52O(
MG6\V1GV+YX)5W":I2(WW4AH=;<;3TK<0;[0TK@CSIXJ-Y*[QMLS27.0V]S\:
M6A=R^MR6QK2%QME08\RM,1VFC51=7QZY:71J3S'7H#&/W-29 =%'ZFFF>%:'
MW,MN@FR_1^,U=Q;NX&F8QJNPMM)D7JV.T:YI2^SJRM\ )5T!0:?P?MLFI/0%
M!-J".D2P8.K=9(2Z?!%PI6NA#2-L-34)'FD5;&MY#'WH%$9UZX\0/5LD^>?/
M AZ:XW+TW(HOCV?OSLN9)+)0RF;'M'>+]P3V#\_Z#[@IT*<3?V%7(/9K<M>D
M()=W'+JUU3GWZF1S/(O?Y<1E^+ ]"=A=L$<L+L]RX,%8'C5>O*U0#4C62%; 
M(N.K (_/)VS+K7^9+O&$_ME^0%*.CVK8=OOMBE/PH<,[9GXFAW+*(J_5E$74
M85!,D"XIF;ODB'M388_& :GN[X.JU2J5CMS-&C7K\V%PBZ<LR4,PJ#P @PMB
M@W8ZMLE<']1HCU# P9-O9< 3*9/]RT'&8_RE:C2-RB\D606TK4P=;TR!*3S9
M"4;O.2Q@V!-^AVZ!;K*-?^/BDQ&M6J73V=\CI5?LBE3KDO_=/?*;[5K\UG_!
M)JU&\&+BWYBP4*F R<CCUXD469+>. B\[HL7\<P>3?0PY^?#9SXX?B>F8X.!
MDS<H1W7$/Z!7,=IM@*MNU T8U1S%T[^?P2_AH2 J$LZV00X=A\C+X%*8S\0-
MLXS\88T?:C1OWIV6Y>M!R)C)LTN4%<M-SQ1W0R>K)W]]P(?ONLL"L6@W,7)N
MG.&+.3YQ=:[[9])39XGAR2[^01[U69-D,2'E*\X#204T<4QZ^/= &LG(ANB.
MR-);&X2,N[-AU,RUT!?Q-*'E']P3;K$A#9T@.O<,">8* GC*\(.?%3SA'OKO
MP!(G/43S($$*=0_)J?>(S%@2S+(%,]%GV^XF;/D>,^VA+=_:DO$U&98LTE/]
M<#&=\16SE-# F#$S>D\'Z%"BN_4XG'5&;L>V.<Y2'8+K5$];X>,-5$R+1F"[
M8!GI;DYE8?1"C@75D\],0#<T#/@$O*8\,:2H!_!?5QP<3!HV/ ))1!,D>@!8
MQQ3QF["U16HR2)!G\.%9*"%P1?X#"R4%Y$*C]:3L8W BY7DUQ>/_P!>D->&"
M^:"\$#WE^SF+FP_FZ8#\,9)7IQ7:.*6A#('K*0ORV(+I9(3X/AACHJ\Z&#/'
M,Y:YV)TY$]\BK_@'>7-X(0-& KC1%%(+#5"?[.%T2<,\S8E:[<"'1 0 6*1H
M87N2;5^^9E,?3(V17OSMB_2$._(A1Q6I*(6+KZ<(R#+YF,V< OX$"K)TC=8>
M:NYB_[X/<%A 8<9=7);E?M9XH=T.B4\H@O)96U("QV'9PR&$&NKLKB5][J89
ME-(#8)1;_H(&AAW(EV5%8\N7,%R5@"]O;_1?R>C;.(;863K1+*32L>S(4?$;
M&Q8+U++DR[>H$\T(F2X=L)%D$Q@RNXTG$/CE<=_/!H1EDPD(<*0&6;;O.71*
ML A\#!Z,Y9-2"+S<VC OQBJ*W,=<IJ47^)3T+ON'7SY<O#U F@FE@H47* "=
M>.AJQUS8P33;'GM7-/#;%VDVBYHA"V(DH-HBNREJ((N[*>F-.=@TB!"B./_@
M6[>'QGWPAQ057):1'5@U5")1)3E$K+5'F#$R5$5#533 IW2KM7IC65_*+/#O
M#/=%FTAT6'I]>?D>8_7^^=&O_;0@(QB%\O)JAD!R<Z^/1$TQ]0(^$M2#>5,2
MAM5%K )B!4G9N!?S%Y=*FFEK\Y>SL1$7\K"^"77I"*?$%6YAWE.2N[D_R&$3
M#$X7GS@K*&U'&Z<!9@%6]Y;D==8BEUG45OW<+IIL3H>+#"^VR>5X8NGG=Q(=
M"6+9HT3Z(-UC4L+)5BN8SH0&H$,XPY,R3MP/%1XD?_T:=1G*N"!Y+6;G6[D7
MO1%#^8H_%DM4%(!E/?7UBWP[UL$?AF&0\IL>1F%QI5Q&7'[KQF_>\%.<[$C=
M$.P_.SO_4"M)EE *N!+.,O +C5!0IG!V=H[P6W*Z$.PF]OAXOG28CGC*ZI3-
M !JK+W,3#SCX71Z,E;) ()YN:C%,;\"L<L$F_(81F/)@R2 G]N5N9:?,[A J
M:'(BOR2&A_W)&1B=L!]8/#VM[I1A@0V4H7F?P5I$\HJ559!ABW@!#J--MT1=
M@W:78PADI=[%NLM5 $E 0#0&)MU8'00-S4_5B= TP7?)',-:?1<I47+4OU '
M7:1I (^FPUT0U^S-GU =.9=B6U)=AD06HDK=43*22M>&:,L-3 GC>_R*LE02
M3/$JP<G&2#MEGSE#16"F>A"Y0F$4@"6H2)<QRV "8QEJ<529Y#\OE-R9Q\X?
MX\AYL4\IY#S3>HTHYAFX\C??4E:>2E-!>-'=23516K>B[XQ["UU8R%W7*I6'
M<FU1_HC,._I4!M>#GNC_2+FLO-!+Z9\^8^&=@?4^&:/?/Y.I 9%TDESI%<8#
M"(SM*CN'YGNX9E[HH2PEL;LLR;[.ZT0OS\_?]A/O$XT>Z9]7:?[W59^)8RC4
MK\)S*-1(5669.)2O@Y1_*M6"E\JM.E4V\2(">8C/W=U=C;PDU<+C)F:?Y>?V
MJ/-C(^8DT?N<#AN?!D%*U?@LB#6.@E"Z^&"W?=3?[WG;)V-<^F_[K+&)8#YZ
M?%6"'^TG@,"KCTY?'<O=IX!T[B:"M3=L[>L[*:!6,5KY6PC6YJHRWSATWWN7
M*JPK@Z,JLXD73%5AE!Q=*,J68&*RK"8.^*V&HW["H 1U?76..C#>)8W]UOXD
MI39HJ,@-48W01+7-9 -\S_K QO/2#/R*_/ICN#!G^/DSF&\7?RI!2/D(E0]]
M_NP9,HGS5RA#6[7A1<4E,C?+,?$K3U",#S#KRB8+%U#^A)MF* 38WNW8=F84
MX7* @2+Z2>@L/71J45A9"7]F])*YN!C?@MZM-=1I.EKZ6U_44=^U[]VY?!'\
M/!"0;.RW)1<05]SB'ZE12ND- +7W@A[T7H"GAK]7W)K"/Z@/!_\/4$L! A0#
M"@    @ RCE-.!XPS#J9$@  B7\  !(              *2!     &5X96-U
C=&EO;E]L;V<N:'1M;%!+!08      0 ! $    #)$@     ! 
end


Mime
View raw message