harmony-alerts mailing list archives

Site index · List index
Message view « Date » · « Thread »
Top « Date » · « Thread »
From nom...@intel.com
Subject [build-test alert] FAILED Windows 2003 x86: jdktools-test debug
Date Sun, 10 Feb 2008 14:49:39 GMT

BUILD FAILED:
	Ant Error Message:
D:\cc\cc-common\scripts\cc-exec-adaptor.xml:104: The following error occurred while executing
this line: D:\cc\cc-common\adaptors\jdktools-test\adaptor.xml:24: The following error occurred
while executing this line: D:\cc\cc-common\build\checkouts\hdk\working_jdktools\build.xml:242:
The following error occurred while executing this line: D:\cc\cc-common\build\checkouts\hdk\working_jdktools\make\build-test.xml:97:
There were test errors.

Date of build:	2008-02-10 20:25:12 +0600
Time to build:	24 minutes 19 seconds
Last changed:	02/10/2008 17:01:08
Last log entry:	hdk

***********************************************************
Errors/Warnings:	(230)
            
Result: 1
[cc-ant]: Test Suite 'jdktools-test' execution. Repository updated: ${repository.updated}
[cc-ant]: Check for 'run' failure of hdk = ${hdk.parameters.run.failed}
[cc-ant]: Result: failed.superiors = '${failed.superiors}'
========================================
Testing jdktools binaries...
========================================
Compiling JPDA tests
Since fork is false, ignoring memoryMaximumSize setting
----------
1. WARNING in D:\cc\cc-common\build\checkouts\hdk\working_jdktools\modules\jpda\test\common\unit\org\apache\harmony\jpda\tests\framework\DebuggeeRegister.java
(at line 58)
registered.add(debuggee);
^^^^^^^^^^^^^^^^^^^^^^^^
Type safety: The method add(Object) belongs to the raw type LinkedList. References to generic
type LinkedList<E> should be parameterized
----------
----------
2. WARNING in D:\cc\cc-common\build\checkouts\hdk\working_jdktools\modules\jpda\test\common\unit\org\apache\harmony\jpda\tests\framework\TestOptions.java
(at line 505)
internalProperties.put(name, value);
^^^^^^^^^^^^^^^^^^^^^^^^^^^^^^^^^^^
Type safety: The method put(Object, Object) belongs to the raw type HashMap. References to
generic type HashMap<K,V> should be parameterized
----------
----------
3. WARNING in D:\cc\cc-common\build\checkouts\hdk\working_jdktools\modules\jpda\test\common\unit\org\apache\harmony\jpda\tests\framework\jdwp\PacketDispatcher.java
(at line 114)
eventQueue.add(eventPacket);
^^^^^^^^^^^^^^^^^^^^^^^^^^^
Type safety: The method add(Object) belongs to the raw type List. References to generic type
List<E> should be parameterized
----------
4. WARNING in D:\cc\cc-common\build\checkouts\hdk\working_jdktools\modules\jpda\test\common\unit\org\apache\harmony\jpda\tests\framework\jdwp\PacketDispatcher.java
(at line 249)
replies.put(new Integer(replyPacket.getId()),
replyPacket);
^^^^^^^^^^^^^^^^^^^^^^^^^^^^^^^^^^^^^^^^^^^^^^^^^^^^^^^^^^^^^^^^^^^^^^^^^^^^^^^^^^^^^^^^^^^
Type safety: The method put(Object, Object) belongs to the raw type Hashtable. References
to generic type Hashtable<K,V> should be parameterized
----------
5. WARNING in D:\cc\cc-common\build\checkouts\hdk\working_jdktools\modules\jpda\test\common\unit\org\apache\harmony\jpda\tests\framework\jdwp\PacketDispatcher.java
(at line 284)
commands.put(Id, command);
^^^^^^^^^^^^^^^^^^^^^^^^^
Type safety: The method put(Object, Object) belongs to the raw type Hashtable. References
to generic type Hashtable<K,V> should be parameterized
----------
6. WARNING in D:\cc\cc-common\build\checkouts\hdk\working_jdktools\modules\jpda\test\common\unit\org\apache\harmony\jpda\tests\framework\jdwp\PacketDispatcher.java
(at line 355)
commands.put(Id, command);
^^^^^^^^^^^^^^^^^^^^^^^^^
Type safety: The method put(Object, Object) belongs to the raw type Hashtable. References
to generic type Hashtable<K,V> should be parameterized
----------
----------
7. WARNING in D:\cc\cc-common\build\checkouts\hdk\working_jdktools\modules\jpda\test\common\unit\org\apache\harmony\jpda\tests\framework\jdwp\VmMirror.java
(at line 1834)
frames.add(frame);
^^^^^^^^^^^^^^^^^
Type safety: The method add(Object) belongs to the raw type ArrayList. References to generic
type ArrayList<E> should be parameterized
----------
8. WARNING in D:\cc\cc-common\build\checkouts\hdk\working_jdktools\modules\jpda\test\common\unit\org\apache\harmony\jpda\tests\framework\jdwp\VmMirror.java
(at line 1902)
vars.add(var);
^^^^^^^^^^^^^
Type safety: The method add(Object) belongs to the raw type ArrayList. References to generic
type ArrayList<E> should be parameterized
----------
9. WARNING in D:\cc\cc-common\build\checkouts\hdk\working_jdktools\modules\jpda\test\common\unit\org\apache\harmony\jpda\tests\framework\jdwp\VmMirror.java
(at line 2122)
fields.add(superClassFields.toArray()[i]);
^^^^^^^^^^^^^^^^^^^^^^^^^^^^^^^^^^^^^^^^^
Type safety: The method add(Object) belongs to the raw type ArrayList. References to generic
type ArrayList<E> should be parameterized
----------
10. WARNING in D:\cc\cc-common\build\checkouts\hdk\working_jdktools\modules\jpda\test\common\unit\org\apache\harmony\jpda\tests\framework\jdwp\VmMirror.java
(at line 2132)
fields.add(field);
^^^^^^^^^^^^^^^^^
Type safety: The method add(Object) belongs to the raw type ArrayList. References to generic
type ArrayList<E> should be parameterized
----------
----------
11. WARNING in D:\cc\cc-common\build\checkouts\hdk\working_jdktools\modules\jpda\test\common\unit\org\apache\harmony\jpda\tests\jdwp\DebuggerOnDemand\OnthowDebuggerLaunchDebuggee.java
(at line 94)
class ExceptionForDebugger extends Exception {
^^^^^^^^^^^^^^^^^^^^
The serializable class ExceptionForDebugger does not declare a static final serialVersionUID
field of type long
----------
----------
12. WARNING in D:\cc\cc-common\build\checkouts\hdk\working_jdktools\modules\jpda\test\common\unit\org\apache\harmony\jpda\tests\jdwp\Events\ClassUnloadDebuggee.java
(at line 32)
import java.util.LinkedList;
^^^^^^^^^^^^^^^^^^^^
The import java.util.LinkedList is never used
----------
13. WARNING in D:\cc\cc-common\build\checkouts\hdk\working_jdktools\modules\jpda\test\common\unit\org\apache\harmony\jpda\tests\jdwp\Events\ClassUnloadDebuggee.java
(at line 97)
boolean isOutOfMemory = false;
^^^^^^^^^^^^^
The local variable isOutOfMemory is never read
----------
14. WARNING in D:\cc\cc-common\build\checkouts\hdk\working_jdktools\modules\jpda\test\common\unit\org\apache\harmony\jpda\tests\jdwp\Events\ClassUnloadDebuggee.java
(at line 171)
public Class loadClass(String name) throws ClassNotFoundException {
^^^^^
Type safety: The return type Class for loadClass(String) from the type ClassUnloadDebuggee.CustomLoader
needs unchecked conversion to conform to Class<?> from the type ClassLoader
----------
15. WARNING in D:\cc\cc-common\build\checkouts\hdk\working_jdktools\modules\jpda\test\common\unit\org\apache\harmony\jpda\tests\jdwp\Events\ClassUnloadDebuggee.java
(at line 179)
public Class findClass(String name) throws ClassNotFoundException {
^^^^^
Type safety: The return type Class for findClass(String) from the type ClassUnloadDebuggee.CustomLoader
needs unchecked conversion to conform to Class<?> from the type ClassLoader
----------
----------
16. WARNING in D:\cc\cc-common\build\checkouts\hdk\working_jdktools\modules\jpda\test\common\unit\org\apache\harmony\jpda\tests\jdwp\Events\CombinedEvents002Test.java
(at line 100)
boolean expectColocatedEvents = (testedMethodStartCodeIndex == testedMethodEndCodeIndex);
^^^^^^^^^^^^^^^^^^^^^
The local variable expectColocatedEvents is never read
----------
----------
17. WARNING in D:\cc\cc-common\build\checkouts\hdk\working_jdktools\modules\jpda\test\common\unit\org\apache\harmony\jpda\tests\jdwp\Events\CombinedEvents003Test.java
(at line 53)
private boolean eventMethodExitReceived = false;
^^^^^^^^^^^^^^^^^^^^^^^
The field CombinedEvents003Test.eventMethodExitReceived is never read locally
----------
18. WARNING in D:\cc\cc-common\build\checkouts\hdk\working_jdktools\modules\jpda\test\common\unit\org\apache\harmony\jpda\tests\jdwp\Events\CombinedEvents003Test.java
(at line 76)
int EXPECTED_EVENTS_COUNT = EXPECTED_EVENTS_ARRAY.length;
^^^^^^^^^^^^^^^^^^^^^
The local variable EXPECTED_EVENTS_COUNT is never read
----------
----------
19. WARNING in D:\cc\cc-common\build\checkouts\hdk\working_jdktools\modules\jpda\test\common\unit\org\apache\harmony\jpda\tests\jdwp\Events\CombinedEventsTest.java
(at line 84)
int EXPECTED_EVENTS_COUNT = EXPECTED_EVENTS_ARRAY.length;
^^^^^^^^^^^^^^^^^^^^^
The local variable EXPECTED_EVENTS_COUNT is never read
----------
20. WARNING in D:\cc\cc-common\build\checkouts\hdk\working_jdktools\modules\jpda\test\common\unit\org\apache\harmony\jpda\tests\jdwp\Events\CombinedEventsTest.java
(at line 212)
int EXPECTED_EVENTS_COUNT = EXPECTED_EVENTS_ARRAY.length;
^^^^^^^^^^^^^^^^^^^^^
The local variable EXPECTED_EVENTS_COUNT is never read
----------
21. WARNING in D:\cc\cc-common\build\checkouts\hdk\working_jdktools\modules\jpda\test\common\unit\org\apache\harmony\jpda\tests\jdwp\Events\CombinedEventsTest.java
(at line 348)
int EXPECTED_EVENTS_COUNT = EXPECTED_EVENTS_ARRAY.length;
^^^^^^^^^^^^^^^^^^^^^
The local variable EXPECTED_EVENTS_COUNT is never read
----------
22. WARNING in D:\cc\cc-common\build\checkouts\hdk\working_jdktools\modules\jpda\test\common\unit\org\apache\harmony\jpda\tests\jdwp\Events\CombinedEventsTest.java
(at line 732)
String failureMessage = "## FAILURE during checking events! !";
^^^^^^^^^^^^^^
The local variable failureMessage is never read
----------
23. WARNING in D:\cc\cc-common\build\checkouts\hdk\working_jdktools\modules\jpda\test\common\unit\org\apache\harmony\jpda\tests\jdwp\Events\CombinedEventsTest.java
(at line 894)
String failureMessage = "## FAILURE during checking events !";
^^^^^^^^^^^^^^
The local variable failureMessage is never read
----------
----------
24. WARNING in D:\cc\cc-common\build\checkouts\hdk\working_jdktools\modules\jpda\test\common\unit\org\apache\harmony\jpda\tests\jdwp\Events\CombinedEventsTestCase.java
(at line 135)
long methodStartCodeIndex = lineTableReply.getNextValueAsLong();
^^^^^^^^^^^^^^^^^^^^
The local variable methodStartCodeIndex is never read
----------
25. WARNING in D:\cc\cc-common\build\checkouts\hdk\working_jdktools\modules\jpda\test\common\unit\org\apache\harmony\jpda\tests\jdwp\Events\CombinedEventsTestCase.java
(at line 187)
long methodStartCodeIndex = reply.getNextValueAsLong();
^^^^^^^^^^^^^^^^^^^^
The local variable methodStartCodeIndex is never read
----------
----------
26. WARNING in D:\cc\cc-common\build\checkouts\hdk\working_jdktools\modules\jpda\test\common\unit\org\apache\harmony\jpda\tests\jdwp\Events\ExceptionTest.java
(at line 188)
long frameID = reply.getNextValueAsFrameID();
^^^^^^^
The local variable frameID is never read
----------
----------
27. WARNING in D:\cc\cc-common\build\checkouts\hdk\working_jdktools\modules\jpda\test\common\unit\org\apache\harmony\jpda\tests\jdwp\ThreadReference\FramesTest.java
(at line 450)
frames.add(new FrameStruct(frameID, loc));
^^^^^^^^^^^^^^^^^^^^^^^^^^^^^^^^^^^^^^^^^
Type safety: The method add(Object) belongs to the raw type Vector. References to generic
type Vector<E> should be parameterized
----------
----------
28. WARNING in D:\cc\cc-common\build\checkouts\hdk\working_jdktools\modules\jpda\test\common\unit\org\apache\harmony\jpda\tests\jdwp\share\JDWPUnitDebuggeeProcessWrapper.java
(at line 233)
argv.add(val);
^^^^^^^^^^^^^
Type safety: The method add(Object) belongs to the raw type Vector. References to generic
type Vector<E> should be parameterized
----------
29. WARNING in D:\cc\cc-common\build\checkouts\hdk\working_jdktools\modules\jpda\test\common\unit\org\apache\harmony\jpda\tests\jdwp\share\JDWPUnitDebuggeeProcessWrapper.java
(at line 253)
return (String[])argv.toArray(args);
^^^^^^^^^^^^^^^^^^
Type safety: The method toArray(Object[]) belongs to the raw type Vector. References to generic
type Vector<E> should be parameterized
----------
29 problems (29 warnings)
JPDA exclude list: D:\cc\cc-common\build\checkouts\hdk\working_classlib\deploy\build\jdktools.jpda.exclude
Running JPDA tests
Debugger JVM=D:\cc\cc-common\build\checkouts\hdk\target\hdk\jdk\jre/bin/java
Debuggee JVM=D:\cc\cc-common\build\checkouts\hdk\target\hdk\jdk\jre/bin/java
SAMSA exclude list: D:\cc\cc-common\build\checkouts\hdk\working_classlib\deploy\build\jdktools.samsa.exclude
Running SAMSA tests
test.jre.home=D:\cc\cc-common\build\checkouts\hdk\target\hdk\jdk\jre
Run jdk/bin/java -version in D:\cc\cc-common\build\checkouts\hdk\working_jdktools\build\test_report
java version "1.5.0"
pre-alpha : not complete or compatible
svn = r620258, (Feb 10 2008), Windows/ia32/msvc 1310, debug build
http://harmony.apache.org
Run jdk/bin/javac -version in D:\cc\cc-common\build\checkouts\hdk\working_jdktools\build\test_report
Run jdk/bin/javah in D:\cc\cc-common\build\checkouts\hdk\working_jdktools\build\test_report
Run jdk/bin/javadoc in D:\cc\cc-common\build\checkouts\hdk\working_jdktools\build\test_report
Run jdk/bin/jarsigner in D:\cc\cc-common\build\checkouts\hdk\working_jdktools\build\test_report
Run jdk/bin/keytool -help in D:\cc\cc-common\build\checkouts\hdk\working_jdktools\build\test_report
Run jdk/bin/unpack200 in D:\cc\cc-common\build\checkouts\hdk\working_jdktools\build\test_report
Compiling TOOLS tests
Since fork is false, ignoring memoryMaximumSize setting
----------
1. WARNING in D:\cc\cc-common\build\checkouts\hdk\working_jdktools\modules\tools\src\test\java\org\apache\harmony\tests\tools\javah\Test\Test01.java
(at line 24)
private static final long xxx2 = 1;
^^^^
The field Test01.xxx2 is never read locally
----------
1 problem (1 warning)
TOOLS exclude list: D:\cc\cc-common\build\checkouts\hdk\working_classlib\deploy\build\jdktools.tools.exclude
Running TOOLS tests
test.jre.home=D:\cc\cc-common\build\checkouts\hdk\target\hdk\jdk\jre
The test report is in D:\cc\cc-common\build\checkouts\hdk\working_jdktools\build\test_report\html\index.html
The execution FAILED with the following exception:
The following error occurred while executing this line:
D:\cc\cc-common\adaptors\jdktools-test\adaptor.xml:24: The following error occurred while
executing this line:
D:\cc\cc-common\build\checkouts\hdk\working_jdktools\build.xml:242: The following error occurred
while executing this line:
D:\cc\cc-common\build\checkouts\hdk\working_jdktools\make\build-test.xml:97: There were test
errors.

***********************************************************
Unit Tests: (160)
        
error: testOwnedMonitors001 org.apache.harmony.jpda.tests.jdwp.ThreadReference.OwnedMonitorsTest
Unit Test Error Details:	(1)
                
Test: testOwnedMonitors001Class: org.apache.harmony.jpda.tests.jdwp.ThreadReference.OwnedMonitorsTestorg.apache.harmony.jpda.tests.framework.TestErrorException:
Debuggee process did not finish during timeout
	at org.apache.harmony.jpda.tests.jdwp.share.JDWPUnitDebuggeeProcessWrapper.WaitForProcessExit(JDWPUnitDebuggeeProcessWrapper.java:284)
	at org.apache.harmony.jpda.tests.jdwp.share.JDWPUnitDebuggeeProcessWrapper.finishProcessAndRedirectors(JDWPUnitDebuggeeProcessWrapper.java:87)
	at org.apache.harmony.jpda.tests.jdwp.share.JDWPUnitDebuggeeWrapper.stop(JDWPUnitDebuggeeWrapper.java:109)
	at org.apache.harmony.jpda.tests.jdwp.share.JDWPTestCase.internalTearDown(JDWPTestCase.java:108)
	at org.apache.harmony.jpda.tests.jdwp.share.JDWPSyncTestCase.internalTearDown(JDWPSyncTestCase.java:83)
	at org.apache.harmony.jpda.tests.jdwp.share.JDWPRawTestCase.tearDown(JDWPRawTestCase.java:118)
Caused by: java.lang.IllegalThreadStateException: process has not exited
	at java.lang.Runtime$SubProcess.exitValue(Runtime.java:357)
	at org.apache.harmony.jpda.tests.jdwp.share.JDWPUnitDebuggeeProcessWrapper.WaitForProcessExit(JDWPUnitDebuggeeProcessWrapper.java:279)
	at org.apache.harmony.jpda.tests.jdwp.share.JDWPUnitDebuggeeProcessWrapper.finishProcessAndRedirectors(JDWPUnitDebuggeeProcessWrapper.java:87)
	... 14 more

***********************************************************
Modifications since last successful build:	(1)
            
add cc-hdk log20080210170108Lbuild.552 02/10/2008 17:01:08hdk

begin 644 execution_log.zip
M4$L#! H    ( #&F2CB"F)\\5A(  'E_   2    97AE8W5T:6]N7VQO9RYH
M=&UL[5U]4^,XTO\;JN8[Z/;JJ0M5Q),7()#+<,7Q<L/L,/ 0AKVKR=R4L)7$
MX%@^R0:R\^QW?[HE.XGMQ D@AC!UJ5TFD:56JW_=K59;EEO]<.#MMJZX,]QM
M!8+MMBB1X=!C[_[2Y7Y8EN[OK$FV*__SU[_LOEF- H>&K"QO_>:;U3>K9<G"
M*"A?.S<AYYXLWTE='%?+EHL(FQU$@>?:<-TA@>#7S Z)3P>,N#YQ!P$7H47.
MXO(+'I0_LEOF8<V B7!('-9U?3=TN2_U=R#3=84,L?U!LV/;\%_9YH,!]SO2
M%FX0RD[<VF72NA]XA/H.H3V*'>;;7$6NYW3L/K-O> 1M^\Y-YXZ+&]?O?4L&
MU!G0&Y:AB@,,F0QAA 0_7YC=YU_)ZKL%/ZL7T!@Z(4DGY,KUJ4#JEK4X%63#
M]ACUR\B,+,,8@BA4XK=Y,"Q?"U;NNA[3B-C] 7>R97&U9C*B,M2)]%4UL,&-
MXXJO9%\P!2+\:#Y.BKH2=O%-,$3^^3J0.!CU4\LE@](^'P2NA]+_<':P1^(6
MS\9,Q_:HE"SIXIK>4GN2B5JC2B2/A,V(PH6$_)GZ;+L^=@+MB"M)EWJ2K1.W
MYW.!? S8@(OA";UW!]&@#9Z @,&CDJ:)E$>?='G5(K_MG7\Z_O2/QQN:5KW.
M-7@4-8Y.W#H")]#AHM>A 04:G3X54#P<5Y2=K@"W@A0[!^PJZO48.V<]5X9,
M6,A@FE=2HB$!X3.RN;V6OK0BXF;,L:CCE)R8VMI?2:;BOV=\TM4NA@$(DG99
M.&R2BSX#,8=]#BX):)]>H>-;(U?,XWY/ 1]"#4'O2(C-/KK^#7,^ CL6.6==
MX GP4]5ZS&?"M;/56H>[1/9YY#E DP0490)# 2R=Q4"<55Y;%G#1;YX&:D8H
MQK6RF076]4$4/O7.QIX<G&4)IZ-U<DN]"#!>$.('HXT=:;37R3S4WU/9/Z%!
M(>1QG=:OZY?/A'A]61"_=NZ"SAFU;UAXX,J AM"BV*:KU8TL]A!6^.'_1BQB
MRJC53TWS(9B;M.RY-FW FC=>+X:UC9V\8X90,C%:=D>.P9Y[3)2P?*B)6ST6
M'CNEM;7U#-TYGPD2C_$!C_T\C^\(Z97'YGH/5<N _]A\Q3JVG?,3V#$L&+22
M'3OK)"Y87"M^!DRW7B^F]<W<O/]?3(O*&TN%]>7@Q!6"SYG?M^LYPU5TI)K<
MU=?YX)J;S/>$H,.Y,_JHUI.G]>U7"-E.I9:%[)8*#1A\*8;K]4*U\_J@JE5K
M.:BZ+O,<#9:,8/&TC]F%(UT8<B6NTMH7]^OC@Z?7"W&U\AHQKA=AK+[^S!YT
M)I8OG,12",;Y*W'J'S",4SJG/@CR+BG^2"/?[B=)KD*8=_+Q+1HN.;RWF<JA
M''&1D"7L/F00)8TODN^9QGJMM(#U]C%U*%SJN;]C]$(*>G4X .WSD#@,:@E&
M\(8$#0'RKNM3+Z9SR82$AI^/#XC23<*[6B50G9X(^0NGMA3DAYB/D!WE5C_[
M'J?.0OCFC5C?4R'XTXI"U[/&N<&L.9.'P%E %U/)/KL%+".YL,]\X>S24X2^
MT\@*_0KX8=0'09Q&X6GW1.71R3N=8)\A=C)'X!ZW0?LA,G*5!:5)CR0N&%U4
MXB^<"WJ*Q*N-:E;D073E@8]0E @24M]*[5#=R<"4[AK,,(+?25WG$P^/>.0[
M\YP;661B$RR,A*\=D.:@RT6.BS72%7R@YKEQS<RH]R,9\L%'* (P?<; _:)S
M!Q28 \M4_U;[/9P)X1?T,L"OBE+K;[O3.M"T%M2)%\[=/$TG<OG!E$[ [+$$
M.I'E8OEU8J:NO'!.**4K?'"%6P'TSTJEAC>%BK6E4IGEM-E] *'I/D>'&R8T
MP7F7L%_FG*@@MAU2 74<=NP[[)Z\>T<FKQX"R,FU7-0\U=\O[/>G<_<(_S\3
MUQ?._Q3A6I^+ZV8]YP2$>PN2(B-XD58,T[T;GC.;N;=@2'-FYT+4IN&FP]+I
M(YC%0PI&C;PW7!"V%\X!/0VVQM:4>[/D\)]GA_L7AP??#B\//UVTO^V??OYT
M 4!ER_?.S_?^97G,[X7]:?@]SM*F]V[2TEXX%S0;LKEXY>^3_$1XU5XX?_,$
M7&K5_ +P)P)F&9(QCP.FOI';5O0S ;-,*9.' =/(ITSB]4&7NEXDV F3DO88
M@/++G_],CO:./WX^/R1.I.JH,>$7-:/+/Y$__;)05F4N-)G.'X/),F54'CB[
MY-.4C\=DB2"9"=4RI6)R4.U3.6?E7<_=8<<L;)SNSZZ45)L+E.@Y[K'!#3J?
MV'UXB=OM]F!EZO=*TY=,CW)Q4WEXC#4M4V;D$1!MYW*411")5X3,3,26*#\Q
M2BC-STMLY^($!92ZIW=\, .;(WVU&)[Y#B[NPR0(RY!,N.CC0$:W$3M*6O-G
MH8W-7(IH8D\)[C=4A&!FBNRP% MO'86ZM@QWO2_A*A>%MT]UE>?;(KX,*0D)
M%UCGP\%O9Y^A19)3/1,<!")_$S0(YNT)K.=22E3T;N-]*MZ/VJ?RX^"L+4-:
MXNFPY3.!<48^SKQ_^;JF<$QVJ\ /.3-7._H\UF*37C3,T/=2 (W/U8'G'TA2
M@A]W5/@@&+F&#TL%,,\ !&5V;WN1PS(/3*G'I.)+(&\9/NRA*'7[WW.O.@Y,
M9GP8UTVTQT)EL&+J\8.#4Q_;.H]\?]I#6\EU0D:["CY<GKQ;A$,(1V!J55^O
M\7_!WD*L]7:L:3G:S!SM+]=H'N-Q@9U8VDZLV$ZT:-10+;03Z](5842]$Z@$
M6F_%VR)P;DN3Q!))\ E,4ETG1WHI(YNDLDX.<7.0_GKA#AAA'@TD<YIDR]K>
M(I+93Z>T:56VZL9(-;:-D=HQQE6UMFF,JWK5&%>-FBE2M6JQV.N+DJIN6L6B
MJBU,J6+5MI9112&*-R:K>=JPL2BM^H:UL;VQC%9H3M\W=XP-<&.S6!VV%I9[
M#;34G,8;E%;%G+0V-QK&N*H:\Z3UFC$EK>T4#W!A,ZP!A :%M67,P9M3K.4B
M8]1B3"&W8>UL&QH@D-K:64+C:]3-33;FN#(Y;\WAZB%>O5XU9L<-<[+:,!A<
M+:&?,KN4,*?M!@=8-8>@2:Y^YBG"H$X97#0;4T]S(C?D$7 J-3C3&#(8LUP9
M="[&/,)2QE3+I>5&0[/J9C%R"R<5:K":,1B;-7[8"!^R7*L8<IT X>9//;,;
M7C[\$.^R^0!5K]>6+S/Q>$]5S:T=MNN@H=/4ZK!]L<@=A,S=<>OTSF?."0<:
MT"%RI/97'1X8L4I3V=JJ03"J!E<GIFF96X#MU(O-X &+U27,SIF\D;-MSE_,
M60H\)$$P[T[.@V@5^Y[%[TXTK&U3&&[,U="7F-%P]C<72!C,^)D*= V2JEFU
M;6-+.H.AH,DLEKETBLD U:"VFUQ)_XA%U+38Y/';)]YS;V)7[=-9W['JAJ#9
M:IC#!KSVCJ%U2,-J[!@R"21E: ( 4E5S2QI3:S: L#'G/O!#(#1UP\#@'(Y*
M6C,HK;HA%XGZ8"S4-&:&6ZA;FM2;U9!'=K\</V(BU7'LS7$Y4S0F2MGH6/;F
M_,UZ[;V3]C/NUI-T(">VZV&_-O=M"F+YQ*%;5Y]KKT\RQ[/W?4Y\A@_+DY#=
MA^O$X>HX!A[VU='B\_?[Z0&I&ND*6&1="_#W?, >N2<OUR6>R#_:J$?*R6D+
MC]T:.^/4>^CPGME?R9Z:L,A[/6$1?;83$Z1)2O8:V>?!4+B]?DBJ.SN@:;5*
M95MM,XV;M7DWO,-#D]0Y%E2=8<$%<4$Y/==FO@0U6B<4< C46QCPO,ET_VJ0
MR1A_J5J@I+^0=!70MC+U@CX%IO"@)AA]X+&084_X';H%NNDV\M;'9Q>V:I7:
MYO8Z*1VQ*UQ)(O]KZ^0WUW?XG7SKTGKM[4#>VJ1:KX+!J*/6B9)8FEP_#(/F
MV[?)M![/\C#A%Z-G/SM\A[;G@GF3#RA&?:(_@%>Q&@U JV[5+1C5&,3COY_ 
M+Q&@'"H*S89%]CR/J,O@4)ADXI8Y5O&P^L\UF@^?CLOJ;2"DS]3I(]J(U69D
MBKN4T]73OS[C8W+-:5%8O,L7.;=.\#T<7[@^P/TK:>F3P?!L%KE;1'W4)%U,
M2/F*\U!1 47LDQ;^W54VTG,AM".J],X%(>.N:1@U\QUT13Q+:/H']VH[K$LC
M+XQ/,4."A8( GG+\X&<&3[BW_0>PQ$D+T=Q-D4+=0W+ZM2$CE@1S7,%L=-FN
M_Q"V9,!LM^NJE[3D7$V.)8>T=#]<#$=\)2RE-#!AS(Y?RP$ZE.IN,0Y'G9&[
MOFOW\U2[X#GUXU#XV $5PWDC<'VPC&PWQZHP?O_&A.JI9QF@&QJ%? !.4YWV
M,:\'\%]7'!Q,%C8\Q$C$\R-Z %C$S.,W96N3U%2,H$[4PW-,(N"*_ =621K(
MB4:+25EB;*+D>37$P_S %V0UX9Q)4%Z(G8K]G,/M9_-T0/X R>NS!UV<T5"&
MP/60A45LP7320WR?C3'1UAWTF1=8TUSLRIB)[[%7_(-\V#M7\2(!W&@&J8D&
MJ$]N=SBE89'FQ*U6X$-B @ L4G2P/<FW+]^PH0138Z25?/NF/.&*>@I1!RI:
MX9+K&0*J3#W^,J: /X&"*EV@=8":.]F_E "' Q1&W"5E>>Y'C2?:K9#D="$H
M'[4E)7 <CMOM0JBA3]^:TN=:ED$E/0!&N^5O:&#8@7HW5CRV8@G#507X]/96
M^T@%W]8!A,[*B>8A58YE18V*W[JP5J".H]ZU1;UX1LAUZ8&-I)O D-E=,H' 
MKX!+F8\'RS83$. H#7)<&7AT2+ (? R>:R5)*0)>[ER8%Q,51>X3+K/2"R4E
MK8OVWK?/YQ]WD69*J6#9!0I !P&ZVCX7;CC,M\?>-0W\]DV9S:1FJ(($":@V
MR6Z&&LCB?DA:?0XV#2*$*$[N?F^VT+AW_U"B@LLJL@.KADHDKJ2&B+76";-Z
MEJYHZ8H6^)1FM5;?F-:7-@O\.\)]TB92'9;>7UR<8:C>/MW_M9T59 RCT%Y>
MSQ!(;NSUD:@MAD'(>X(&,&\JPK"X2%1 S""I&K<2_I)213-K;7(Z&P_B0AVW
M-Z ^[>&4.,,MC'M*<S?V!P5L@L&9XA-G!:WM:.,TQ"3 [-[2O(Y:%#*+VFJ>
MVTF3+>APDN')-H4<#QSS_ [BPSL<MY?*'F1[3$LXW6H&T[G0 '0(9WA2QHG[
MN<*#]*]?XRXC%1>DKR7L?"^WXM==:%_QQV2)C@*PK*6_?E.OP=K]P[(L4O[0
MPB@LJ53(B,_O_.2U&C+#R8K2#<'^L[+R#[V29"FE@"O1*/T^T0@%90MO964?
MOZ6G"\%N$X^/IT5'V8BGK,_)#*&Q_C(V\9"#W^5A7RL+!.+9I@[#[ ;,*N=L
MP&\9@2D/E@QJ8I_N5E;*[!ZA@B:'ZDMJ>-B?FH'1"<O0X=EI=:4,"VR@#,W;
M#-8BBE>LK(,,5R0+<!AMMB7J&K2[Z$,@J_0NT5VN T@" J(),-G&^DQG:'ZL
M#W>F*;Y+=A_6ZFM(B9+]]KD^B2)+ WBT/>Z#N$8O^H3JR+D2VY3J*B1R$%7J
M]]*15+8V1%M^:"L8S_ KRE)+,,.K B<?(ZV4)?.ZFL!(]2!RA<(X $M142YC
ME, $QG+4DJ@RS7]1*+DRCITOD\AYLD\EY"+3>H\H%AFX]C??,U:>25-!>-%<
MR3316C>C[YQ[BWQ8R-W4*I7G<FUQ_HB,._I2!M>#GNC_2+FLO= [Y9^^8N&]
MA?6^6+W?OY*A!9%TFESI".,!!,;UM9U#\W5<,T_T4%:26)N68U_D[:$7IZ<?
MVZG7A\:/VH^K;/[WS9ZI$R+T+REL?4P$=C#M? @]4EU9)0[5>Q_5GTIUSGOC
M9IT(FWJM@#IEY_[^OD;>D>K<8R!&G^D'Z^BS7V/F%-&GG.R:G-) 2M7DC(8%
MCFC0NOAL=WWTWQ]YUR=G7.;O^BRP@V \>GSK@8PW$T#@U4:GKP_6;E- NG '
MP<*[M;8,[IFL6+6ZH2?6*N-=-4^]=ZGCNC)XJC(;!.%0%\;9T8FB? EF)LMZ
MYH#?>CCZ)PQ*4%_JH]"!\2;9V-S9&&3T!BT5N2&Z$=JHL:FL@^]5[[AXJ)F%
M7Y%?V8<+8X;?K,*$._E3"T+)1^B$Z)O55602)[!(Q;9ZNXL.3%1REF/F5QUV
MF!PQUE1-)BZ@_ FW[4@(,+Z[ONN-*,+E$"-%=)3X:O;,T*E# ]P%/+)ZQ5Q2
MC&\];]8V]#$W1OI;7-1QW[4?W;EZ\?LX$E!L[#04%Q!8W.$?I5%:Z2T M?66
M[K;>@JN&OU?<&<(_J ^[_P]02P$"% ,*    "  QIDHX@IB?/%82  !Y?P  
M$@              I($     97AE8W5T:6]N7VQO9RYH=&UL4$L%!@     !
-  $ 0    (82      $! 
end


Mime
View raw message