harmony-alerts mailing list archives

Site index · List index
Message view « Date » · « Thread »
Top « Date » · « Thread »
From nom...@intel.com
Subject [build-test alert] FAILED Windows 2003 x86_64: drlvm debug
Date Thu, 07 Feb 2008 13:37:20 GMT

BUILD FAILED:
	Ant Error Message:
C:\cc\cc-short\scripts\cc-exec-adaptor.xml:104: The following error occurred while executing
this line: C:\cc\cc-short\adaptors\drlvm\adaptor.xml:37: The following error occurred while
executing this line: C:\cc\cc-short\adaptors\drlvm\adaptor.xml:48: The following error occurred
while executing this line: C:\cc\cc-short\scripts\framework.xml:1079: Java returned: 1

Date of build:	2008-02-07 19:36:19 +0600
Time to build:	44 seconds
Last changed:	02/07/2008 19:15:25
Last log entry:	classlib

***********************************************************
Errors/Warnings:	(11)
            
[cc-ant]: Test Suite 'drlvm' execution. Repository updated: ${repository.updated}
[cc-ant]: Check for 'run' failure of classlib = ${classlib.parameters.run.failed}
[cc-ant]: Result: failed.superiors = '${failed.superiors}'
[cc-ant]: Do cleanup for C:\cc\cc-short/build/checkouts/drlvm
BUILD FAILED
C:\cc\cc-short\build\checkouts\drlvm\build.xml:24: The following error occurred while executing
this line:
C:\cc\cc-short\build\checkouts\drlvm\make\properties.xml:50: Primary dependency is missing:
common_resources.
You need to check it out from SVN repository or specify it's location:
ant -Dcommon.resources.loc=path
Total time: 0 seconds
The execution FAILED with the following exception:
The following error occurred while executing this line:
C:\cc\cc-short\adaptors\drlvm\adaptor.xml:37: The following error occurred while executing
this line:
C:\cc\cc-short\adaptors\drlvm\adaptor.xml:48: The following error occurred while executing
this line:
C:\cc\cc-short\scripts\framework.xml:1079: Java returned: 1

***********************************************************
Unit Tests: (0)
        
No Tests Run: This project doesn't have any tests

***********************************************************
Modifications since last successful build:	(1)
            
add cc-classlib log20080207191525Lbuild.648 02/07/2008 19:15:25classlib

begin 644 execution_log.zip
M4$L#! H    ( *B<1SBY"P%#.0(  (P&   2    97AE8W5T:6]N7VQO9RYH
M=&ULK57O;]HP$/T>B?_AODQ\@L#&2NM1I&YL4J>JFK1VTE309)Q+XY'8ENWP
M8W_]+@F4D0)#W:)\2.QW]^[NO<2#Q&?I<##5T6HX,!:' P[.KU*\;,9:^9:3
MOY#!>>?5N^:P$>0FXAY;;JY8(X#B>D"1Z D\"-'BRD\8C#2(%+G*#<3:P@<V
M%H+NEDNT]>$TEVD4B@3%3.?>A9%-Y]E3JB6*"5QYL#B73FH%9]V+7N>LW0@:
M@<W_X"R!H^*Y3+AG/>,S/ 1O+[.TQED\>Z*8'5H?[R&J[XXC-*@B=RS_&FFL
M-FB]Q%/ F[3;H(,!S]NN;9Y48PDDD?\..K&/'>83VC@FT]1R10;:&\P?:\OW
MI6$C\+IFJGY[ _S)YWP"[PO&6*9D]F?D%:*&O[^^&<&GJ^N;CZ/=G5W'KR5\
M<ORX=/RV0?:ZQ^ N0?I8TE0OI'H$M)8^'"U$;BV5ODBH*BC:R7VQ[1/I()4*
MV0MX]XC&WG88?+$RXW8%E4:HQ J()9/.$24#H;-,JQ\6G<ZMH+A=ZLWU7>>@
ML!IWR0S2 [%#;'4&7[_=D@A&.^DU45&/SJ"0,5'Y)K6D!?>D#]N?F_XNT!I5
MA;2WA5#4I>$^.:;5G?8\!2\S$K<##H4F&S:"H!C[>JYDBTI+6$B?T(QW!%D*
M-&5IP8N5JJG#(VYH"AM9UJ^E'&_Z_V"(TVEZY_^/Q@DK#7DLMCS#A;:SDJ';
MZ5\P^$P2D.P^MPHC!EWZE0]"/AR$Y6$35@=/6)Y"OP%02P$"% ,*    " "H
MG$<XN0L!0SD"  ",!@  $@              I($     97AE8W5T:6]N7VQO
<9RYH=&UL4$L%!@     !  $ 0    &D"      $! 
end


Mime
View raw message