harmony-alerts mailing list archives

Site index · List index
Message view « Date » · « Thread »
Top « Date » · « Thread »
From nom...@intel.com
Subject [build-test alert] FAILED Windows 2003 x86: drlvm debug
Date Thu, 07 Feb 2008 13:28:26 GMT

BUILD FAILED:
	Ant Error Message:
C:\cc\cc-short\scripts\cc-exec-adaptor.xml:104: The following error occurred while executing
this line: C:\cc\cc-short\adaptors\drlvm\adaptor.xml:37: The following error occurred while
executing this line: C:\cc\cc-short\adaptors\drlvm\adaptor.xml:48: The following error occurred
while executing this line: C:\cc\cc-short\scripts\framework.xml:1079: Java returned: 1

Date of build:	2008-02-07 19:26:59 +0600
Time to build:	1 minute 4 seconds
Last changed:	02/07/2008 19:18:45
Last log entry:	classlib

***********************************************************
Errors/Warnings:	(7)
            
BUILD FAILED
C:\cc\cc-short\build\checkouts\drlvm\build.xml:24: The following error occurred while executing
this line:
C:\cc\cc-short\build\checkouts\drlvm\make\properties.xml:50: Primary dependency is missing:
common_resources.
You need to check it out from SVN repository or specify it's location:
ant -Dcommon.resources.loc=path
Total time: 0 seconds
The execution FAILED with the following exception:
The following error occurred while executing this line:
C:\cc\cc-short\adaptors\drlvm\adaptor.xml:37: The following error occurred while executing
this line:
C:\cc\cc-short\adaptors\drlvm\adaptor.xml:48: The following error occurred while executing
this line:
C:\cc\cc-short\scripts\framework.xml:1079: Java returned: 1

***********************************************************
Unit Tests: (0)
        
No Tests Run: This project doesn't have any tests

***********************************************************
Modifications since last successful build:	(1)
            
add cc-classlib log20080207191845Lbuild.654 02/07/2008 19:18:45classlib

begin 644 execution_log.zip
M4$L#! H    ( (R;1S@-BU$'%@(  $$&   2    97AE8W5T:6]N7VQO9RYH
M=&ULK95M:]LP$,??&_(=[LW(J\3)EO5!<P/=LD%'&8.V@S&7H<CG6HLE&4G.
MPS[]SG;2$C?)0C>3%X[T/_WN[G]84>95/HZF)EF-H\+B..+@_"K'BVYJM.\Y
M^1L9G U>O>N..T%9)-QCS\TUZP10/3]PB>(>+CU8G$LGC8:3X?EH<-+O!)W 
MEFWAI'J?EC)/=JPK/L-]\OY2Y2UF]>X),=NW'NX M7?#! O4B3MT_EI96%.@
M]1*/$6^.?0K:&_"\[-;F43G60G+F[Z(CZ]@B'U'&(9NFEFN1[0[F#ZWENWK*
M$O!FQU UPE]\SN_A?45,94X3^@S>*%KZNZOK"7RZO+K^.-G>^<!B(>C7<YFQ
M/JY/BREA,3.E=W%B\[F*'QGL]8C!;8:0FCPW"ZD? *TU%HP0I;64^B*CK* J
MI_35ML^D@UQJ9"_@5D;$VZ:QMP,&7ZU4W*Z@\0BU6 %1E'2.D R$4<KHGQ:=
M*:V@N&WTYOEN2M#8M+LF@_1 =$BM47#S[0N94!@GO2$4U>@*%#(EE.]2249P
M3_ZPW6=S[:$W:1+I/R5"41<%]]DAKVZ-YSEXJ<C< 3@4AL:P$P15V]=]I;%H
MO(2%]!GU>,N0I<"B3BUXL5,M=WC""^K"QI;UW]J.-Z?_,!#'8T9G_P_CA)4%
MS5AJN<*%L;.:,!R<GC/X3!:0[;ZT&A,&0_J41R$?1V%]0X3-;1'65\<?4$L!
M A0#"@    @ C)M'. V+40<6 @  008  !(              *2!     &5X
F96-U=&EO;E]L;V<N:'1M;%!+!08      0 ! $    !& @     ! 
end


Mime
View raw message