harmony-alerts mailing list archives

Site index · List index
Message view « Date » · « Thread »
Top « Date » · « Thread »
From nom...@intel.com
Subject [build-test alert] FAILED Linux x86: drlvm debug
Date Thu, 07 Feb 2008 13:23:52 GMT

BUILD FAILED:
	Ant Error Message:
/export/users/cc/cc-short/scripts/cc-exec-adaptor.xml:104: The following error occurred while
executing this line: /export/users/cc/cc-short/adaptors/drlvm/adaptor.xml:37: The following
error occurred while executing this line: /export/users/cc/cc-short/adaptors/drlvm/adaptor.xml:48:
The following error occurred while executing this line: /export/users/cc/cc-short/scripts/framework.xml:1079:
Java returned: 1

Date of build:	2008-02-07 19:23:11 +0600
Time to build:	25 seconds
Last changed:	02/07/2008 19:16:46
Last log entry:	classlib

***********************************************************
Errors/Warnings:	(11)
            
[cc-ant]: Test Suite 'drlvm' execution. Repository updated: ${repository.updated}
[cc-ant]: Check for 'run' failure of classlib = ${classlib.parameters.run.failed}
[cc-ant]: Result: failed.superiors = '${failed.superiors}'
[cc-ant]: Do cleanup for /export/users/cc/cc-short/build/checkouts/drlvm
BUILD FAILED
/export/users/cc/cc-short/build/checkouts/drlvm/build.xml:24: The following error occurred
while executing this line:
/export/users/cc/cc-short/build/checkouts/drlvm/make/properties.xml:50: Primary dependency
is missing: common_resources.
You need to check it out from SVN repository or specify it's location:
ant -Dcommon.resources.loc=path
Total time: 0 seconds
The execution FAILED with the following exception:
The following error occurred while executing this line:
/export/users/cc/cc-short/adaptors/drlvm/adaptor.xml:37: The following error occurred while
executing this line:
/export/users/cc/cc-short/adaptors/drlvm/adaptor.xml:48: The following error occurred while
executing this line:
/export/users/cc/cc-short/scripts/framework.xml:1079: Java returned: 1

***********************************************************
Unit Tests: (0)
        
No Tests Run: This project doesn't have any tests

***********************************************************
Modifications since last successful build:	(1)
            
add cc-classlib log20080207191646Lbuild.605 02/07/2008 19:16:46classlib

begin 644 execution_log.zip
M4$L#! H    ( />:1SB8846H+ (  *D&   2    97AE8W5T:6]N7VQO9RYH
M=&ULM55=:]LP%'WWK[@O(T^IDS5;6\T-=&2#CC(&:P>CA*'(U[466Q+ZR$=_
M_:[MA.!\M%G&A!]LZ>B>>^\YLI+<E\4PF>AT.4R,Q6'"P?EE@=>=3"O?=?(9
M&5SVWGSH#*-@4NZQZV:*15"-1Q2Y'L.C$%VN_)C!2(,HD*M@(-,68EP8;7T<
M'%H7"T%/U^75S"3((HU%CF*J@W=Q:HM9N0ZZ0#&&&P\69]))K>!]_VK0.S^+
M(ALVU#5J5+W7P7:G2S[% ^"S15FTV:IW3^&G!Z;C79+MQ3A%@RIU+P1? 8W5
M!JV7> 1V'72SYQ!^I]ZMM6/RJW$D\*N8XTIHT;Y>P0O:3"Q79)=]6_E3>_:A
MMFD*7N\ZJ,']YC,^AH\56R8+,O@V<0-HHQ]N[T;P^>;V[M.HM?"7)M\4R=X.
M&-SG2$>E*/1<JB= :^G8:"&"M53!/*?LH*HJ^&K9Y])!(16R?\I@CX#L78_!
M-RM+;I?0"(9*+('X2ND<D3,0NBRU^F71Z6 %[6LEL1X_=0"%3?MK8I >B!PR
MJTOX_N,KB6*TDUX3$Q7K# J9$9/O4&U:<$]ZL;VAZ1\#W5&3QMDF#=IT;;C/
M#VMWKSTOP,N2I.Z!0Z')CU%4]7[57+)((RW,I<^IT2U5%@)-D]:I<AV6B*?<
M4"_6VJP^:TW.+T[WQTF$@\O_0>B$E8;,EUE>XES;:<W5[UU<,?A"^I A?+ *
M4P;]*(GY,(GKFRAN;J6XOJ+^ %!+ 0(4 PH    ( />:1SB8846H+ (  *D&
M   2              "D@0    !E>&5C=71I;VY?;&]G+FAT;6Q02P4&    
/  $  0!     7 (      
end


Mime
View raw message