harmony-alerts mailing list archives

Site index · List index
Message view « Date » · « Thread »
Top « Date » · « Thread »
From nom...@intel.com
Subject [build-test alert] FAILED Windows 2003 x86: jdktools-test debug
Date Wed, 06 Feb 2008 11:41:22 GMT

BUILD FAILED:
	Ant Error Message:
D:\cc\cc-common\scripts\cc-exec-adaptor.xml:104: The following error occurred while executing
this line: D:\cc\cc-common\adaptors\jdktools-test\adaptor.xml:24: The following error occurred
while executing this line: D:\cc\cc-common\build\checkouts\hdk\working_jdktools\build.xml:242:
The following error occurred while executing this line: D:\cc\cc-common\build\checkouts\hdk\working_jdktools\make\build-test.xml:97:
There were test errors.

Date of build:	2008-02-06 17:17:04 +0600
Time to build:	24 minutes 10 seconds
Last changed:	02/06/2008 12:25:57
Last log entry:	hdk

***********************************************************
Errors/Warnings:	(230)
            
Result: 1
[cc-ant]: Test Suite 'jdktools-test' execution. Repository updated: ${repository.updated}
[cc-ant]: Check for 'run' failure of hdk = ${hdk.parameters.run.failed}
[cc-ant]: Result: failed.superiors = '${failed.superiors}'
========================================
Testing jdktools binaries...
========================================
Compiling JPDA tests
Since fork is false, ignoring memoryMaximumSize setting
----------
1. WARNING in D:\cc\cc-common\build\checkouts\hdk\working_jdktools\modules\jpda\test\common\unit\org\apache\harmony\jpda\tests\framework\DebuggeeRegister.java
(at line 58)
registered.add(debuggee);
^^^^^^^^^^^^^^^^^^^^^^^^
Type safety: The method add(Object) belongs to the raw type LinkedList. References to generic
type LinkedList<E> should be parameterized
----------
----------
2. WARNING in D:\cc\cc-common\build\checkouts\hdk\working_jdktools\modules\jpda\test\common\unit\org\apache\harmony\jpda\tests\framework\TestOptions.java
(at line 505)
internalProperties.put(name, value);
^^^^^^^^^^^^^^^^^^^^^^^^^^^^^^^^^^^
Type safety: The method put(Object, Object) belongs to the raw type HashMap. References to
generic type HashMap<K,V> should be parameterized
----------
----------
3. WARNING in D:\cc\cc-common\build\checkouts\hdk\working_jdktools\modules\jpda\test\common\unit\org\apache\harmony\jpda\tests\framework\jdwp\PacketDispatcher.java
(at line 114)
eventQueue.add(eventPacket);
^^^^^^^^^^^^^^^^^^^^^^^^^^^
Type safety: The method add(Object) belongs to the raw type List. References to generic type
List<E> should be parameterized
----------
4. WARNING in D:\cc\cc-common\build\checkouts\hdk\working_jdktools\modules\jpda\test\common\unit\org\apache\harmony\jpda\tests\framework\jdwp\PacketDispatcher.java
(at line 249)
replies.put(new Integer(replyPacket.getId()),
replyPacket);
^^^^^^^^^^^^^^^^^^^^^^^^^^^^^^^^^^^^^^^^^^^^^^^^^^^^^^^^^^^^^^^^^^^^^^^^^^^^^^^^^^^^^^^^^^^
Type safety: The method put(Object, Object) belongs to the raw type Hashtable. References
to generic type Hashtable<K,V> should be parameterized
----------
5. WARNING in D:\cc\cc-common\build\checkouts\hdk\working_jdktools\modules\jpda\test\common\unit\org\apache\harmony\jpda\tests\framework\jdwp\PacketDispatcher.java
(at line 284)
commands.put(Id, command);
^^^^^^^^^^^^^^^^^^^^^^^^^
Type safety: The method put(Object, Object) belongs to the raw type Hashtable. References
to generic type Hashtable<K,V> should be parameterized
----------
6. WARNING in D:\cc\cc-common\build\checkouts\hdk\working_jdktools\modules\jpda\test\common\unit\org\apache\harmony\jpda\tests\framework\jdwp\PacketDispatcher.java
(at line 355)
commands.put(Id, command);
^^^^^^^^^^^^^^^^^^^^^^^^^
Type safety: The method put(Object, Object) belongs to the raw type Hashtable. References
to generic type Hashtable<K,V> should be parameterized
----------
----------
7. WARNING in D:\cc\cc-common\build\checkouts\hdk\working_jdktools\modules\jpda\test\common\unit\org\apache\harmony\jpda\tests\framework\jdwp\VmMirror.java
(at line 1834)
frames.add(frame);
^^^^^^^^^^^^^^^^^
Type safety: The method add(Object) belongs to the raw type ArrayList. References to generic
type ArrayList<E> should be parameterized
----------
8. WARNING in D:\cc\cc-common\build\checkouts\hdk\working_jdktools\modules\jpda\test\common\unit\org\apache\harmony\jpda\tests\framework\jdwp\VmMirror.java
(at line 1902)
vars.add(var);
^^^^^^^^^^^^^
Type safety: The method add(Object) belongs to the raw type ArrayList. References to generic
type ArrayList<E> should be parameterized
----------
9. WARNING in D:\cc\cc-common\build\checkouts\hdk\working_jdktools\modules\jpda\test\common\unit\org\apache\harmony\jpda\tests\framework\jdwp\VmMirror.java
(at line 2122)
fields.add(superClassFields.toArray()[i]);
^^^^^^^^^^^^^^^^^^^^^^^^^^^^^^^^^^^^^^^^^
Type safety: The method add(Object) belongs to the raw type ArrayList. References to generic
type ArrayList<E> should be parameterized
----------
10. WARNING in D:\cc\cc-common\build\checkouts\hdk\working_jdktools\modules\jpda\test\common\unit\org\apache\harmony\jpda\tests\framework\jdwp\VmMirror.java
(at line 2132)
fields.add(field);
^^^^^^^^^^^^^^^^^
Type safety: The method add(Object) belongs to the raw type ArrayList. References to generic
type ArrayList<E> should be parameterized
----------
----------
11. WARNING in D:\cc\cc-common\build\checkouts\hdk\working_jdktools\modules\jpda\test\common\unit\org\apache\harmony\jpda\tests\jdwp\DebuggerOnDemand\OnthowDebuggerLaunchDebuggee.java
(at line 94)
class ExceptionForDebugger extends Exception {
^^^^^^^^^^^^^^^^^^^^
The serializable class ExceptionForDebugger does not declare a static final serialVersionUID
field of type long
----------
----------
12. WARNING in D:\cc\cc-common\build\checkouts\hdk\working_jdktools\modules\jpda\test\common\unit\org\apache\harmony\jpda\tests\jdwp\Events\ClassUnloadDebuggee.java
(at line 32)
import java.util.LinkedList;
^^^^^^^^^^^^^^^^^^^^
The import java.util.LinkedList is never used
----------
13. WARNING in D:\cc\cc-common\build\checkouts\hdk\working_jdktools\modules\jpda\test\common\unit\org\apache\harmony\jpda\tests\jdwp\Events\ClassUnloadDebuggee.java
(at line 97)
boolean isOutOfMemory = false;
^^^^^^^^^^^^^
The local variable isOutOfMemory is never read
----------
14. WARNING in D:\cc\cc-common\build\checkouts\hdk\working_jdktools\modules\jpda\test\common\unit\org\apache\harmony\jpda\tests\jdwp\Events\ClassUnloadDebuggee.java
(at line 171)
public Class loadClass(String name) throws ClassNotFoundException {
^^^^^
Type safety: The return type Class for loadClass(String) from the type ClassUnloadDebuggee.CustomLoader
needs unchecked conversion to conform to Class<?> from the type ClassLoader
----------
15. WARNING in D:\cc\cc-common\build\checkouts\hdk\working_jdktools\modules\jpda\test\common\unit\org\apache\harmony\jpda\tests\jdwp\Events\ClassUnloadDebuggee.java
(at line 179)
public Class findClass(String name) throws ClassNotFoundException {
^^^^^
Type safety: The return type Class for findClass(String) from the type ClassUnloadDebuggee.CustomLoader
needs unchecked conversion to conform to Class<?> from the type ClassLoader
----------
----------
16. WARNING in D:\cc\cc-common\build\checkouts\hdk\working_jdktools\modules\jpda\test\common\unit\org\apache\harmony\jpda\tests\jdwp\Events\CombinedEvents002Test.java
(at line 100)
boolean expectColocatedEvents = (testedMethodStartCodeIndex == testedMethodEndCodeIndex);
^^^^^^^^^^^^^^^^^^^^^
The local variable expectColocatedEvents is never read
----------
----------
17. WARNING in D:\cc\cc-common\build\checkouts\hdk\working_jdktools\modules\jpda\test\common\unit\org\apache\harmony\jpda\tests\jdwp\Events\CombinedEvents003Test.java
(at line 53)
private boolean eventMethodExitReceived = false;
^^^^^^^^^^^^^^^^^^^^^^^
The field CombinedEvents003Test.eventMethodExitReceived is never read locally
----------
18. WARNING in D:\cc\cc-common\build\checkouts\hdk\working_jdktools\modules\jpda\test\common\unit\org\apache\harmony\jpda\tests\jdwp\Events\CombinedEvents003Test.java
(at line 76)
int EXPECTED_EVENTS_COUNT = EXPECTED_EVENTS_ARRAY.length;
^^^^^^^^^^^^^^^^^^^^^
The local variable EXPECTED_EVENTS_COUNT is never read
----------
----------
19. WARNING in D:\cc\cc-common\build\checkouts\hdk\working_jdktools\modules\jpda\test\common\unit\org\apache\harmony\jpda\tests\jdwp\Events\CombinedEventsTest.java
(at line 84)
int EXPECTED_EVENTS_COUNT = EXPECTED_EVENTS_ARRAY.length;
^^^^^^^^^^^^^^^^^^^^^
The local variable EXPECTED_EVENTS_COUNT is never read
----------
20. WARNING in D:\cc\cc-common\build\checkouts\hdk\working_jdktools\modules\jpda\test\common\unit\org\apache\harmony\jpda\tests\jdwp\Events\CombinedEventsTest.java
(at line 212)
int EXPECTED_EVENTS_COUNT = EXPECTED_EVENTS_ARRAY.length;
^^^^^^^^^^^^^^^^^^^^^
The local variable EXPECTED_EVENTS_COUNT is never read
----------
21. WARNING in D:\cc\cc-common\build\checkouts\hdk\working_jdktools\modules\jpda\test\common\unit\org\apache\harmony\jpda\tests\jdwp\Events\CombinedEventsTest.java
(at line 348)
int EXPECTED_EVENTS_COUNT = EXPECTED_EVENTS_ARRAY.length;
^^^^^^^^^^^^^^^^^^^^^
The local variable EXPECTED_EVENTS_COUNT is never read
----------
22. WARNING in D:\cc\cc-common\build\checkouts\hdk\working_jdktools\modules\jpda\test\common\unit\org\apache\harmony\jpda\tests\jdwp\Events\CombinedEventsTest.java
(at line 732)
String failureMessage = "## FAILURE during checking events! !";
^^^^^^^^^^^^^^
The local variable failureMessage is never read
----------
23. WARNING in D:\cc\cc-common\build\checkouts\hdk\working_jdktools\modules\jpda\test\common\unit\org\apache\harmony\jpda\tests\jdwp\Events\CombinedEventsTest.java
(at line 894)
String failureMessage = "## FAILURE during checking events !";
^^^^^^^^^^^^^^
The local variable failureMessage is never read
----------
----------
24. WARNING in D:\cc\cc-common\build\checkouts\hdk\working_jdktools\modules\jpda\test\common\unit\org\apache\harmony\jpda\tests\jdwp\Events\CombinedEventsTestCase.java
(at line 135)
long methodStartCodeIndex = lineTableReply.getNextValueAsLong();
^^^^^^^^^^^^^^^^^^^^
The local variable methodStartCodeIndex is never read
----------
25. WARNING in D:\cc\cc-common\build\checkouts\hdk\working_jdktools\modules\jpda\test\common\unit\org\apache\harmony\jpda\tests\jdwp\Events\CombinedEventsTestCase.java
(at line 187)
long methodStartCodeIndex = reply.getNextValueAsLong();
^^^^^^^^^^^^^^^^^^^^
The local variable methodStartCodeIndex is never read
----------
----------
26. WARNING in D:\cc\cc-common\build\checkouts\hdk\working_jdktools\modules\jpda\test\common\unit\org\apache\harmony\jpda\tests\jdwp\Events\ExceptionTest.java
(at line 188)
long frameID = reply.getNextValueAsFrameID();
^^^^^^^
The local variable frameID is never read
----------
----------
27. WARNING in D:\cc\cc-common\build\checkouts\hdk\working_jdktools\modules\jpda\test\common\unit\org\apache\harmony\jpda\tests\jdwp\ThreadReference\FramesTest.java
(at line 450)
frames.add(new FrameStruct(frameID, loc));
^^^^^^^^^^^^^^^^^^^^^^^^^^^^^^^^^^^^^^^^^
Type safety: The method add(Object) belongs to the raw type Vector. References to generic
type Vector<E> should be parameterized
----------
----------
28. WARNING in D:\cc\cc-common\build\checkouts\hdk\working_jdktools\modules\jpda\test\common\unit\org\apache\harmony\jpda\tests\jdwp\share\JDWPUnitDebuggeeProcessWrapper.java
(at line 233)
argv.add(val);
^^^^^^^^^^^^^
Type safety: The method add(Object) belongs to the raw type Vector. References to generic
type Vector<E> should be parameterized
----------
29. WARNING in D:\cc\cc-common\build\checkouts\hdk\working_jdktools\modules\jpda\test\common\unit\org\apache\harmony\jpda\tests\jdwp\share\JDWPUnitDebuggeeProcessWrapper.java
(at line 253)
return (String[])argv.toArray(args);
^^^^^^^^^^^^^^^^^^
Type safety: The method toArray(Object[]) belongs to the raw type Vector. References to generic
type Vector<E> should be parameterized
----------
29 problems (29 warnings)
JPDA exclude list: D:\cc\cc-common\build\checkouts\hdk\working_classlib\deploy\build\jdktools.jpda.exclude
Running JPDA tests
Debugger JVM=D:\cc\cc-common\build\checkouts\hdk\target\hdk\jdk\jre/bin/java
Debuggee JVM=D:\cc\cc-common\build\checkouts\hdk\target\hdk\jdk\jre/bin/java
SAMSA exclude list: D:\cc\cc-common\build\checkouts\hdk\working_classlib\deploy\build\jdktools.samsa.exclude
Running SAMSA tests
test.jre.home=D:\cc\cc-common\build\checkouts\hdk\target\hdk\jdk\jre
Run jdk/bin/java -version in D:\cc\cc-common\build\checkouts\hdk\working_jdktools\build\test_report
java version "1.5.0"
pre-alpha : not complete or compatible
svn = r618908, (Feb  6 2008), Windows/ia32/msvc 1310, debug build
http://harmony.apache.org
Run jdk/bin/javac -version in D:\cc\cc-common\build\checkouts\hdk\working_jdktools\build\test_report
Run jdk/bin/javah in D:\cc\cc-common\build\checkouts\hdk\working_jdktools\build\test_report
Run jdk/bin/javadoc in D:\cc\cc-common\build\checkouts\hdk\working_jdktools\build\test_report
Run jdk/bin/jarsigner in D:\cc\cc-common\build\checkouts\hdk\working_jdktools\build\test_report
Run jdk/bin/keytool -help in D:\cc\cc-common\build\checkouts\hdk\working_jdktools\build\test_report
Run jdk/bin/unpack200 in D:\cc\cc-common\build\checkouts\hdk\working_jdktools\build\test_report
Compiling TOOLS tests
Since fork is false, ignoring memoryMaximumSize setting
----------
1. WARNING in D:\cc\cc-common\build\checkouts\hdk\working_jdktools\modules\tools\src\test\java\org\apache\harmony\tests\tools\javah\Test\Test01.java
(at line 24)
private static final long xxx2 = 1;
^^^^
The field Test01.xxx2 is never read locally
----------
1 problem (1 warning)
TOOLS exclude list: D:\cc\cc-common\build\checkouts\hdk\working_classlib\deploy\build\jdktools.tools.exclude
Running TOOLS tests
test.jre.home=D:\cc\cc-common\build\checkouts\hdk\target\hdk\jdk\jre
The test report is in D:\cc\cc-common\build\checkouts\hdk\working_jdktools\build\test_report\html\index.html
The execution FAILED with the following exception:
The following error occurred while executing this line:
D:\cc\cc-common\adaptors\jdktools-test\adaptor.xml:24: The following error occurred while
executing this line:
D:\cc\cc-common\build\checkouts\hdk\working_jdktools\build.xml:242: The following error occurred
while executing this line:
D:\cc\cc-common\build\checkouts\hdk\working_jdktools\make\build-test.xml:97: There were test
errors.

***********************************************************
Unit Tests: (160)
        
error: testOwnedMonitors001 org.apache.harmony.jpda.tests.jdwp.ThreadReference.OwnedMonitorsTest
Unit Test Error Details:	(1)
                
Test: testOwnedMonitors001Class: org.apache.harmony.jpda.tests.jdwp.ThreadReference.OwnedMonitorsTestorg.apache.harmony.jpda.tests.framework.TestErrorException:
Debuggee process did not finish during timeout
	at org.apache.harmony.jpda.tests.jdwp.share.JDWPUnitDebuggeeProcessWrapper.WaitForProcessExit(JDWPUnitDebuggeeProcessWrapper.java:284)
	at org.apache.harmony.jpda.tests.jdwp.share.JDWPUnitDebuggeeProcessWrapper.finishProcessAndRedirectors(JDWPUnitDebuggeeProcessWrapper.java:87)
	at org.apache.harmony.jpda.tests.jdwp.share.JDWPUnitDebuggeeWrapper.stop(JDWPUnitDebuggeeWrapper.java:109)
	at org.apache.harmony.jpda.tests.jdwp.share.JDWPTestCase.internalTearDown(JDWPTestCase.java:108)
	at org.apache.harmony.jpda.tests.jdwp.share.JDWPSyncTestCase.internalTearDown(JDWPSyncTestCase.java:83)
	at org.apache.harmony.jpda.tests.jdwp.share.JDWPRawTestCase.tearDown(JDWPRawTestCase.java:118)
Caused by: java.lang.IllegalThreadStateException: process has not exited
	at java.lang.Runtime$SubProcess.exitValue(Runtime.java:357)
	at org.apache.harmony.jpda.tests.jdwp.share.JDWPUnitDebuggeeProcessWrapper.WaitForProcessExit(JDWPUnitDebuggeeProcessWrapper.java:279)
	at org.apache.harmony.jpda.tests.jdwp.share.JDWPUnitDebuggeeProcessWrapper.finishProcessAndRedirectors(JDWPUnitDebuggeeProcessWrapper.java:87)
	... 14 more

***********************************************************
Modifications since last successful build:	(1)
            
add cc-hdk log20080206122557Lbuild.540 02/06/2008 12:25:57hdk

begin 644 execution_log.zip
M4$L#! H    ( "F-1CC"=:897A(  (]_   2    97AE8W5T:6]N7VQO9RYH
M=&UL[5UM<]LXDO[L5.4_8&?K:NTJB]&[9*WB*Z_M;)R)XYSE9.XJRJ5@$I(8
M4P07(&UK<O/?KQL@)9&4*-F&8WEJ53,."0*-1C_=C683!+NC<.SM=R^Y,]GO
M!H+M=RF1X<1CK_\VX'Y8DN[OK$/:Y?_X^]_V7[Z( H>&K"2O_<[+%R]?E"0+
MHZ#TW;D*.?=DZ4;JXKA:MEQ$V.PH"CS7ANL."03_SNR0^'3,B.L3=QQP$5KD
M8UQ^P8/2>W;-/*P9,!%.B,,&KN^&+O>E/@8R U?($-L?=?JV#?^5;#X><[\O
M;>$&H>S'K5TFK=NQ1ZCO$#JDV&&^S67D>D[?'C'[BD?0=N1<]6^XN'+]X;=D
M0/TQO6(9JCC D,D01DCP]X79(_Z5O'B]YN_%!32&3DC2";ET?2J0NF6M3P79
ML#U&_1(R(TLPAB *E?AM'DQ*WP4K#5R/:43LT9@[V;*X6B<940GJ1/JJ&MCX
MRG'%5W(HF (13CKWDZ*NA%U\$PR1?[P.) Y&G6JY9% ZY./ ]5#Z[SX>'9"X
MQ:,QT[<]*B5+NOA.KZD]ST2U52&21\)F1.%"0OY(??9<'SN!=L259$ ]R7:)
M._2Y0#[&;,S%Y)3>NN-HW -/0,#@44G31$K37[J\8I'?#LX_G'SXY_T-3:M>
M_SMX%#6.?MPZ B?0YV+8IP$%&OT1%5 \F564_8$ MX(4^T?L,AH.&3MG0U>&
M3%C(8)I7LDU# L)GI-'>25_:$G$SYEC4<;:=F-K.WTFFXO\N^:6K74P"$"0=
ML'#2(1<C!F(.1QQ<$M ^NT3'MT,NF<?]H0(^A!J"WI 0F[UW_2OFO =V+'+.
M!L 3X*>J#9G/A&MGJW6/]XD<\<AS@"8)*,H$A@)8.NN!N*R\NBG@HM\\"]2,
M4(QKN9$%UO5!%#[U/LX\.3C+;9R.=LDU]2+ >$V([XPV=J31WB6K4']+Y>B4
M!H60QW6ZO^Y^?B3$:YN"^'?G)NA_I/85"X]<&= 06A3;=*52SV(/884?_E?$
M(J:,6IUJFG?!W*1EK[1I ]9<?[X85NM[><<,H61BM.R&G( ]#YG8QO*))FX-
M67CB;._L[&;HKOC-D;B/#[CO[W%\1T@O/;;2>ZA:!OQ'XQGK6#OG)[!CN&'0
M2G;B[)*X8'VM^#-@VGR^F-8:N7G_WY@6E;<V"NO/XU-7"+YB?F_7<H:KZ$@U
MN:O#U>":F\P/A*"3E3/ZM-:#I_7V,X1LKUS-0G9-A08,#HKA>KY0[3T_J*J5
M:@ZJ@<L\1X,E([AY.L3LPAM=&'(EKNV=+^[7^P=/SQ?B2ODY8EPKPE@=_ID]
MZ%(LGSB)I1",\U?BS#]B&*?TSWP0Y$U2_)Y&OCU*DER%,._EXULT7')\:S.5
M0WG#14*6L-N0090TNTA^9!KK>Z4UK'>$J4/A4L_]':,74M"KPP%HGX?$85!+
M,((/)&@(D ]<GWHQG<],2&CXZ>2(*-TD?*!5 M7I@9 _<6I+07Z,^0C95V[U
MD^]QZJR%;]Z(]3,5@J=6%+J>-<L-9LV9W 7. KJ82O;9-6 9R;5]YA-GEQXB
M]+U65NB7P ^C/@CB+ K/!J<JCTY>ZP3[$K&3%0+WN W:#Y&1JRPH37HJ<<'H
MNA)_XES00R1>:56R(@^B2P]\A*)$D) ZVNZ%ZDD&IG1W8(81_$;J.A]X^(9'
MOK/*N9%U)C;!PDCXV@%I#@9<Y+C8(0/!QVJ>F]7,C/HPDB$?OX<B --G#-PO
M.G= @3EPF^I?:[^',R&<02]C/%24NO^YOZ@#36M-G7CBW,W#="*7'TSI!,P>
M&Z 362XV7R>6ZLH3YX12NL+'E[@40)^6RU5\*%2L+>7R,J?-;@,(30\Y.MPP
MH0G.>QO[9<ZI"F)[(150QV$GOL-NR>O79/[J,8"<7,M%S0O]_=I^?S%W]_#_
M2W%]XOQ/$:ZUE;@V:CDG(-QKD!29PHNT8IANW?"<V<R]!D-:,3L7HK8(-QV6
M+A[!,AY2,&KDO<F:L#UQ#NAAL+6:"Y[-DN/__GA\>'%\].WX\_&'B]ZWP[-/
M'RX J&SYP?GYP?]8'O.'X6@1?O>SM,6]F[2T)\X%+8=L)5[YYR1_(KRJ3YR_
M>0 NU4K^!O!/!,PF)&/N!TRMGEM6]&<"9I-2)G<#II5/F<3W!P/J>I%@ITQ*
M.F0 RB]__2MY<W#R_M/Y,7$B54>-"0_4C"[_0O[RRUI9E9709#J_#R:;E%&Y
MX^R23U/>'Y,-@F0I5)N4BLE!=4CEBCOO6NX).V9AXW1_]DY)M;E B9[C&AM<
MH/.!W8:?<;G= =R9^L/MQ;=,]W)Q"WFXCS5M4F;D'A"U<SG*(HC$,T)F*6(;
ME)^8)I16YR7:N3A! :6>Z9T<+<'FC;Y:#,]J!Q?W81*$34@F7(QP(-/'B'TE
MK=6S4+V12Q'-K2G!]8:*$,Q,D1UNQ\+;1:'N;,)3[\]PE8O"QZ>ZRN,M$=^$
ME(2$"ZS_[NBWCY^@19)3_2@X"$3^)F@0K%H36,NEE*@87L?K5+R?M4[EY\%9
MW82TQ,-ARV<"XXQ\G'G_\G5'X9BL5H$3N317._W=UV*37C3,T/=& (WOU8'G
M'TNR#2<W5/@@&+F#+TL%,,\ !"5V:WN1PS(O3*G7I.)+(&\9WNVE*/7XWW,O
M^PY,9GP2UTVTQT)EL&+J\8N#"U_;.H]\?]%+6\EU0J:K"MY]/GV]#H<0CL#4
MJ@Z_X_^"O8)8Z]5,TW*TF3G:7[ZC><S&!79B:3NQ8CO1HE%#M=!.K,^N""/J
MG4(ET'HK7A:!<UN:))9(@F]@DLHN>:-O962'E'?),2X.TH<7[I@1YM% ,J=#
MFE:CU2:2V0\GU;#*YDA5RS53I"KE/6.DVBUCI"K&*-6-";U=+2156Y=4I6$U
M]HH!K*Y-JVS5:^94M&X,P6JEF*N[2*M:*=;1^KJT:G6K73=F.N45(#Z-;VA6
MC6E\8X4Z-->6>]5J-(NMYRX:;\ZFRWOFA&6.E$%MJ-6-<55K&++":GFE=[B+
MHZEMHMP->M)RK=AR[C1 <Y.]L1G:I*@V$L!6VYRL:N9(F9-5I5[,U9VBF7)S
M$^6^F3IJD%33W!V%P=L <S<G!@=H,&@HKXB*GFB:,*CM!L5N4-LW,E8S*?:*
M,2]J4D7-#;#2,#? 2F,3IV>#AF.0*Y,J:DSLE;:A7$.U8=5KYD9HSLNL&N'S
MOU\R=V=B4D<W<R)<X=P;=U#W1MV<'S5(ZIZ^H9*[H6C7K+WF(KZ.>Q?K/%W(
M/#FWSFY\YIQRH $=(D=J[=7QD9$$2\703%LQZ'LJ!LV\4K?VVAO(5W.E[MXI
M.VGNIJ5F+EEM+E^S*AN_/BES(F^92T"LFA_7?W#1-AJ&&XQ2-W-6,Q6EHI,Q
M)RM3?K1JU:J&W%7=9#BXB0B"C]DSI:*;:'\FDSY+1;XH+KG_LHJWW)M;;?MP
MUO>LABF!-EO6GJFD<<MJ-0VQ!:1,*7'+:AN:<H$I@TM'#)D[ -BJ&>(*2-7-
MR<K4 P0<H:E8U2!;H%>FYJ2F.0?91 \9C_#EBY!']J@4OWDBU2[MG5DY4T3F
M2METM_;.ZC5\O8/3WB,NXI-T+.=6\6&_-O=M"G+YP*%;5V]WKS<XQRWY?4Y\
MAN_0DY#=AKO$X6J7!AZ.U([CJY<!Z@&I&ND*6&1]%^#N^9C=<ZE>KDO<J'^Z
M?H^4DDT8[KMB=LEF^-#A+;._D@,U7Y&W>KXB>LLG)DB';-L[Y) '$^$.1R&I
M[.V!JE7+Y;9:?1HWZ_%!>(-[*:GM+:C:VH(+XH)V>J[-? EJM$LHX!"HCS/@
M-I3I_M4@DS'^4K% 2W\AZ2J@;27J!2,*3.'^33#ZP&,APY[P&+H%NNDV\MK'
M5QJ:E?9>N;U+MM^P2T*:BO^=7?*;ZSO\1KYR::WZ:BRO;5*I5<!BU [L1$DL
M36X4AD'GU:MD5H\G>9COB]&S'QV^8]MSP;[).Q2CWN@?P"M;K1:@5;-J%HQJ
M!N+)/T[A3 0HA[)"LV61 \\CZC)X%":9N&:.53RLT6.-YMV'DY+Z2 @9,;4I
MB39BM4:9XN+E=/7TV2=\>ZZS* B+%_\BY]8I?I[C"]?[NG\E7;UA&&[9(O>+
MJ$^;I(L)*5UR'BHJH(@CTL6_^\I&ABY$=D25WK@@9%Q,#:-FOH.NB&<)+?[A
M$FZ'#6CDA?'F9DBP4!# 4XX?_"WA"9>\_P26..DBFOLI4JA[2$Y_363*DF".
M*YB-+MOU[\*6#)CM#ESU[9:<J\FQY)"N[H>+R92OA*64!B:,V?'7.D"'4MVM
MQ^&T,W(S<NU1GNH /*=^2PK?1J!BLFH$K@^6D>WF1!7&G^684SWUB@-T0Z.0
MC\%IJDU 5O4 _NN2@X/)PH9[&XEX?D0/ /<PJ_A-V=H\-14CJ(WV<'N3"+@B
M_X*;) WD7*/UI"PQ-E'RO)S@'G_@"[*:<,XD*"\$3\5^SN'VHWDZ('^$Y/66
MA"[.:"A#X'K"PB*V8#H9(KZ/QICHZ0Y&S NL12YV:\;$C]@K_D'>'9RK>)$ 
M;C2#U%P#U"=W,%G0L$ASXE9;\",Q 0 6*3K8GN3;EZ[81(*I,=)-CKXI3[BE
M7D[4@8I6N.1ZAH J4V_%S"C@*5!0I6NT#E!SY_N7$N!P@,*4NZ0LS_VT\5R[
M+9)L.@3ET[9D&QR'XPX&$&KH3;D6]+F395!)#X#1;OD;&AAVH#Z9%8^M6,)P
M50&^N+W5>Z.";^L(0F?E1/.0*L>RI4;%KUVX5Z".HS[!1;UX1LAUZ8&-I)O 
MD-E-,H' 6<"ES,>#)9L)"'"4!CFN##PZ(5@$/@:WNY)D.P)>;ER8%Q,51>X3
M+K/2"R4EW8O>P;=/Y^_WD69*J>"^"Q2 C@-TM2,NW'"2;X^]:QIX]$V9S;QF
MJ(($":@VSVZ&&LCB=D*Z(PXV#2*$*$[N_^ATT;CW_U"B@LLJL@.KADHDKJ2&
MB+5V";.&EJYHZ8H6^)1.I5JK+^I+FP7^G>(^;Q.I#K??7EQ\Q%"]=W;X:R\K
MR!A&H;V\GB&0W,SK(U%;3(*0#P4-8-Y4A.'F(E$!L82D:MQ-^$M*%<VLM<G%
M;-R)"[4+WYCZ=(A3XA*W,.LIS=W,'Q2P"09GBD^<%;2VHXW3$), RWM+\SIM
M4<@L:JMY;N=-MJ##>8;GVQ1R/';,\SN.]_1PW&$J>Y#M,2WA=*LE3.=" ] A
MG.%)"2?NQPH/TF>_QEU&*BY(7TO8^5'JQE_!T+[BC_D2'05@65<??E-?Q]K_
MP[(L4GK7Q2@LJ53(B,]O_.1K&S+#R9;2#<'^M;7U3WTGR5)* 5>B:?9]KA$*
MRA;>UM8A'J6G"\&N$X^/FTA'V8BGI+?/#*&Q/IB9>,C![_)PI)4% O%L4X=A
M=@-FE7,VYM>,P)0'MPQJ8E_L5K9*[!:A@B;'ZB U/.Q/S<#HA&7H\.RTNE6"
M&VR@#,U[#.Y%%*]860<9KDANP&&TV9:H:]#N8@2!K-*[1'>Y#B )"(@FP&0;
MZZV>H?F)WO.9IOC>MD=PK[Z#E"@Y[)WK#2JR-(!'V^,^B&OZ_4^HCIPKL2VH
MKD(B!U&E_C =265K0[3EA[:"\2,>HBRU!#.\*G#R,=)623)OH E,50\B5RB,
M [ 4%>4RI@E,8"Q'+8DJT_P7A9);L]CY<Q(YS_>IA%QD6F\1Q2(#U_[F1\;*
M,VDJ""\Z6YDF6NN6])US;Y$/-W)7U7+YL5Q;G#\BLXZ^E,#UH"?Z/U(J:2_T
M6OFGKUAX:V&]+];P]Z]D8D$DG2:W_0;C 03&];6=0_-=O&>>ZZ&D)+&S*,>^
MSD=%+\[.WO=27Q6-W\"?56G\^X.?J8TC])D4MMX] CM8M&V$'JFNK!*'ZG.0
MZD^YLN)S<LLVBDU];4!MOG-[>ULEKTEEY>X0T]_B_7;TEK Q<XKH0S9\339O
M(-N59.N&-79NT+KX:$]]]-^?^=0G9USFG_JLL8!@-GK\&(*,UQ) X-5#IZ_W
MV^Y10+IP <':*[6:YI9+[EG-%6\3K,U5>;:XZJ&/+G585P)'56+C()SHPC@Y
M.E>4+\'$9$E/''"NAZ-/85""^E)OD Z,=TB]V:J,,VJ#AHK<$-T(3=383-;'
MKZWW7=SJS,)#Y%>.X,*,X9<O8+Z=/]6"4/(1.A_Z\L4+9!+GKTB%MGJQBXY+
M5&Z68^)7;8&8;#S644WF+J#\";?M2 BPO9N1ZTTIPN40 T7TD_C!]LS0J4,#
M7/\[-7K%7%*,WT+O5.MZ\QLC_:TOZKCOZL_N7'T.?A8(*#;V6HH+B"MN\(_2
M**WT%H#:?47WNZ_ 4\/?2^Y,X!_4A_W_!U!+ 0(4 PH    ( "F-1CC"=:89
M7A(  (]_   2              "D@0    !E>&5C=71I;VY?;&]G+FAT;6Q0
52P4&      $  0!     CA(      
end


Mime
View raw message