harmony-alerts mailing list archives

Site index · List index
Message view « Date » · « Thread »
Top « Date » · « Thread »
From nom...@intel.com
Subject [build-test alert] FAILED Windows 2003 x86_64: jdktools-test debug
Date Wed, 06 Feb 2008 10:33:58 GMT

BUILD FAILED:
	Ant Error Message:
C:\cc\cc-common\scripts\cc-exec-adaptor.xml:104: The following error occurred while executing
this line: C:\cc\cc-common\adaptors\jdktools-test\adaptor.xml:24: The following error occurred
while executing this line: C:\cc\cc-common\build\checkouts\hdk\working_jdktools\build.xml:242:
The following error occurred while executing this line: C:\cc\cc-common\build\checkouts\hdk\working_jdktools\make\build-test.xml:97:
There were test errors.

Date of build:	2008-02-06 16:06:37 +0600
Time to build:	27 minutes 14 seconds
Last changed:	02/06/2008 08:18:03
Last log entry:	hdk

***********************************************************
Errors/Warnings:	(227)
            
Result: 1
========================================
Testing jdktools binaries...
========================================
Compiling JPDA tests
Since fork is false, ignoring memoryMaximumSize setting
----------
1. WARNING in C:\cc\cc-common\build\checkouts\hdk\working_jdktools\modules\jpda\test\common\unit\org\apache\harmony\jpda\tests\framework\DebuggeeRegister.java
(at line 58)
registered.add(debuggee);
^^^^^^^^^^^^^^^^^^^^^^^^
Type safety: The method add(Object) belongs to the raw type LinkedList. References to generic
type LinkedList<E> should be parameterized
----------
----------
2. WARNING in C:\cc\cc-common\build\checkouts\hdk\working_jdktools\modules\jpda\test\common\unit\org\apache\harmony\jpda\tests\framework\TestOptions.java
(at line 505)
internalProperties.put(name, value);
^^^^^^^^^^^^^^^^^^^^^^^^^^^^^^^^^^^
Type safety: The method put(Object, Object) belongs to the raw type HashMap. References to
generic type HashMap<K,V> should be parameterized
----------
----------
3. WARNING in C:\cc\cc-common\build\checkouts\hdk\working_jdktools\modules\jpda\test\common\unit\org\apache\harmony\jpda\tests\framework\jdwp\PacketDispatcher.java
(at line 114)
eventQueue.add(eventPacket);
^^^^^^^^^^^^^^^^^^^^^^^^^^^
Type safety: The method add(Object) belongs to the raw type List. References to generic type
List<E> should be parameterized
----------
4. WARNING in C:\cc\cc-common\build\checkouts\hdk\working_jdktools\modules\jpda\test\common\unit\org\apache\harmony\jpda\tests\framework\jdwp\PacketDispatcher.java
(at line 249)
replies.put(new Integer(replyPacket.getId()),
replyPacket);
^^^^^^^^^^^^^^^^^^^^^^^^^^^^^^^^^^^^^^^^^^^^^^^^^^^^^^^^^^^^^^^^^^^^^^^^^^^^^^^^^^^^^^^^^^^
Type safety: The method put(Object, Object) belongs to the raw type Hashtable. References
to generic type Hashtable<K,V> should be parameterized
----------
5. WARNING in C:\cc\cc-common\build\checkouts\hdk\working_jdktools\modules\jpda\test\common\unit\org\apache\harmony\jpda\tests\framework\jdwp\PacketDispatcher.java
(at line 284)
commands.put(Id, command);
^^^^^^^^^^^^^^^^^^^^^^^^^
Type safety: The method put(Object, Object) belongs to the raw type Hashtable. References
to generic type Hashtable<K,V> should be parameterized
----------
6. WARNING in C:\cc\cc-common\build\checkouts\hdk\working_jdktools\modules\jpda\test\common\unit\org\apache\harmony\jpda\tests\framework\jdwp\PacketDispatcher.java
(at line 355)
commands.put(Id, command);
^^^^^^^^^^^^^^^^^^^^^^^^^
Type safety: The method put(Object, Object) belongs to the raw type Hashtable. References
to generic type Hashtable<K,V> should be parameterized
----------
----------
7. WARNING in C:\cc\cc-common\build\checkouts\hdk\working_jdktools\modules\jpda\test\common\unit\org\apache\harmony\jpda\tests\framework\jdwp\VmMirror.java
(at line 1834)
frames.add(frame);
^^^^^^^^^^^^^^^^^
Type safety: The method add(Object) belongs to the raw type ArrayList. References to generic
type ArrayList<E> should be parameterized
----------
8. WARNING in C:\cc\cc-common\build\checkouts\hdk\working_jdktools\modules\jpda\test\common\unit\org\apache\harmony\jpda\tests\framework\jdwp\VmMirror.java
(at line 1902)
vars.add(var);
^^^^^^^^^^^^^
Type safety: The method add(Object) belongs to the raw type ArrayList. References to generic
type ArrayList<E> should be parameterized
----------
9. WARNING in C:\cc\cc-common\build\checkouts\hdk\working_jdktools\modules\jpda\test\common\unit\org\apache\harmony\jpda\tests\framework\jdwp\VmMirror.java
(at line 2122)
fields.add(superClassFields.toArray()[i]);
^^^^^^^^^^^^^^^^^^^^^^^^^^^^^^^^^^^^^^^^^
Type safety: The method add(Object) belongs to the raw type ArrayList. References to generic
type ArrayList<E> should be parameterized
----------
10. WARNING in C:\cc\cc-common\build\checkouts\hdk\working_jdktools\modules\jpda\test\common\unit\org\apache\harmony\jpda\tests\framework\jdwp\VmMirror.java
(at line 2132)
fields.add(field);
^^^^^^^^^^^^^^^^^
Type safety: The method add(Object) belongs to the raw type ArrayList. References to generic
type ArrayList<E> should be parameterized
----------
----------
11. WARNING in C:\cc\cc-common\build\checkouts\hdk\working_jdktools\modules\jpda\test\common\unit\org\apache\harmony\jpda\tests\jdwp\DebuggerOnDemand\OnthowDebuggerLaunchDebuggee.java
(at line 94)
class ExceptionForDebugger extends Exception {
^^^^^^^^^^^^^^^^^^^^
The serializable class ExceptionForDebugger does not declare a static final serialVersionUID
field of type long
----------
----------
12. WARNING in C:\cc\cc-common\build\checkouts\hdk\working_jdktools\modules\jpda\test\common\unit\org\apache\harmony\jpda\tests\jdwp\Events\ClassUnloadDebuggee.java
(at line 32)
import java.util.LinkedList;
^^^^^^^^^^^^^^^^^^^^
The import java.util.LinkedList is never used
----------
13. WARNING in C:\cc\cc-common\build\checkouts\hdk\working_jdktools\modules\jpda\test\common\unit\org\apache\harmony\jpda\tests\jdwp\Events\ClassUnloadDebuggee.java
(at line 97)
boolean isOutOfMemory = false;
^^^^^^^^^^^^^
The local variable isOutOfMemory is never read
----------
14. WARNING in C:\cc\cc-common\build\checkouts\hdk\working_jdktools\modules\jpda\test\common\unit\org\apache\harmony\jpda\tests\jdwp\Events\ClassUnloadDebuggee.java
(at line 171)
public Class loadClass(String name) throws ClassNotFoundException {
^^^^^
Type safety: The return type Class for loadClass(String) from the type ClassUnloadDebuggee.CustomLoader
needs unchecked conversion to conform to Class<?> from the type ClassLoader
----------
15. WARNING in C:\cc\cc-common\build\checkouts\hdk\working_jdktools\modules\jpda\test\common\unit\org\apache\harmony\jpda\tests\jdwp\Events\ClassUnloadDebuggee.java
(at line 179)
public Class findClass(String name) throws ClassNotFoundException {
^^^^^
Type safety: The return type Class for findClass(String) from the type ClassUnloadDebuggee.CustomLoader
needs unchecked conversion to conform to Class<?> from the type ClassLoader
----------
----------
16. WARNING in C:\cc\cc-common\build\checkouts\hdk\working_jdktools\modules\jpda\test\common\unit\org\apache\harmony\jpda\tests\jdwp\Events\CombinedEvents002Test.java
(at line 100)
boolean expectColocatedEvents = (testedMethodStartCodeIndex == testedMethodEndCodeIndex);
^^^^^^^^^^^^^^^^^^^^^
The local variable expectColocatedEvents is never read
----------
----------
17. WARNING in C:\cc\cc-common\build\checkouts\hdk\working_jdktools\modules\jpda\test\common\unit\org\apache\harmony\jpda\tests\jdwp\Events\CombinedEvents003Test.java
(at line 53)
private boolean eventMethodExitReceived = false;
^^^^^^^^^^^^^^^^^^^^^^^
The field CombinedEvents003Test.eventMethodExitReceived is never read locally
----------
18. WARNING in C:\cc\cc-common\build\checkouts\hdk\working_jdktools\modules\jpda\test\common\unit\org\apache\harmony\jpda\tests\jdwp\Events\CombinedEvents003Test.java
(at line 76)
int EXPECTED_EVENTS_COUNT = EXPECTED_EVENTS_ARRAY.length;
^^^^^^^^^^^^^^^^^^^^^
The local variable EXPECTED_EVENTS_COUNT is never read
----------
----------
19. WARNING in C:\cc\cc-common\build\checkouts\hdk\working_jdktools\modules\jpda\test\common\unit\org\apache\harmony\jpda\tests\jdwp\Events\CombinedEventsTest.java
(at line 84)
int EXPECTED_EVENTS_COUNT = EXPECTED_EVENTS_ARRAY.length;
^^^^^^^^^^^^^^^^^^^^^
The local variable EXPECTED_EVENTS_COUNT is never read
----------
20. WARNING in C:\cc\cc-common\build\checkouts\hdk\working_jdktools\modules\jpda\test\common\unit\org\apache\harmony\jpda\tests\jdwp\Events\CombinedEventsTest.java
(at line 212)
int EXPECTED_EVENTS_COUNT = EXPECTED_EVENTS_ARRAY.length;
^^^^^^^^^^^^^^^^^^^^^
The local variable EXPECTED_EVENTS_COUNT is never read
----------
21. WARNING in C:\cc\cc-common\build\checkouts\hdk\working_jdktools\modules\jpda\test\common\unit\org\apache\harmony\jpda\tests\jdwp\Events\CombinedEventsTest.java
(at line 348)
int EXPECTED_EVENTS_COUNT = EXPECTED_EVENTS_ARRAY.length;
^^^^^^^^^^^^^^^^^^^^^
The local variable EXPECTED_EVENTS_COUNT is never read
----------
22. WARNING in C:\cc\cc-common\build\checkouts\hdk\working_jdktools\modules\jpda\test\common\unit\org\apache\harmony\jpda\tests\jdwp\Events\CombinedEventsTest.java
(at line 732)
String failureMessage = "## FAILURE during checking events! !";
^^^^^^^^^^^^^^
The local variable failureMessage is never read
----------
23. WARNING in C:\cc\cc-common\build\checkouts\hdk\working_jdktools\modules\jpda\test\common\unit\org\apache\harmony\jpda\tests\jdwp\Events\CombinedEventsTest.java
(at line 894)
String failureMessage = "## FAILURE during checking events !";
^^^^^^^^^^^^^^
The local variable failureMessage is never read
----------
----------
24. WARNING in C:\cc\cc-common\build\checkouts\hdk\working_jdktools\modules\jpda\test\common\unit\org\apache\harmony\jpda\tests\jdwp\Events\CombinedEventsTestCase.java
(at line 135)
long methodStartCodeIndex = lineTableReply.getNextValueAsLong();
^^^^^^^^^^^^^^^^^^^^
The local variable methodStartCodeIndex is never read
----------
25. WARNING in C:\cc\cc-common\build\checkouts\hdk\working_jdktools\modules\jpda\test\common\unit\org\apache\harmony\jpda\tests\jdwp\Events\CombinedEventsTestCase.java
(at line 187)
long methodStartCodeIndex = reply.getNextValueAsLong();
^^^^^^^^^^^^^^^^^^^^
The local variable methodStartCodeIndex is never read
----------
----------
26. WARNING in C:\cc\cc-common\build\checkouts\hdk\working_jdktools\modules\jpda\test\common\unit\org\apache\harmony\jpda\tests\jdwp\Events\ExceptionTest.java
(at line 188)
long frameID = reply.getNextValueAsFrameID();
^^^^^^^
The local variable frameID is never read
----------
----------
27. WARNING in C:\cc\cc-common\build\checkouts\hdk\working_jdktools\modules\jpda\test\common\unit\org\apache\harmony\jpda\tests\jdwp\ThreadReference\FramesTest.java
(at line 450)
frames.add(new FrameStruct(frameID, loc));
^^^^^^^^^^^^^^^^^^^^^^^^^^^^^^^^^^^^^^^^^
Type safety: The method add(Object) belongs to the raw type Vector. References to generic
type Vector<E> should be parameterized
----------
----------
28. WARNING in C:\cc\cc-common\build\checkouts\hdk\working_jdktools\modules\jpda\test\common\unit\org\apache\harmony\jpda\tests\jdwp\share\JDWPUnitDebuggeeProcessWrapper.java
(at line 233)
argv.add(val);
^^^^^^^^^^^^^
Type safety: The method add(Object) belongs to the raw type Vector. References to generic
type Vector<E> should be parameterized
----------
29. WARNING in C:\cc\cc-common\build\checkouts\hdk\working_jdktools\modules\jpda\test\common\unit\org\apache\harmony\jpda\tests\jdwp\share\JDWPUnitDebuggeeProcessWrapper.java
(at line 253)
return (String[])argv.toArray(args);
^^^^^^^^^^^^^^^^^^
Type safety: The method toArray(Object[]) belongs to the raw type Vector. References to generic
type Vector<E> should be parameterized
----------
29 problems (29 warnings)
JPDA exclude list: C:\cc\cc-common\build\checkouts\hdk\working_classlib\deploy\build\jdktools.jpda.exclude
Running JPDA tests
Debugger JVM=C:\cc\cc-common\build\checkouts\hdk\target\hdk\jdk\jre/bin/java
Debuggee JVM=C:\cc\cc-common\build\checkouts\hdk\target\hdk\jdk\jre/bin/java
SAMSA exclude list: C:\cc\cc-common\build\checkouts\hdk\working_classlib\deploy\build\jdktools.samsa.exclude
Running SAMSA tests
test.jre.home=C:\cc\cc-common\build\checkouts\hdk\target\hdk\jdk\jre
Run jdk/bin/java -version in C:\cc\cc-common\build\checkouts\hdk\working_jdktools\build\test_report
java version "1.5.0"
pre-alpha : not complete or compatible
svn = r618855, (Feb  6 2008), Windows/em64t/msvc 1400, debug build
http://harmony.apache.org
Run jdk/bin/javac -version in C:\cc\cc-common\build\checkouts\hdk\working_jdktools\build\test_report
Run jdk/bin/javah in C:\cc\cc-common\build\checkouts\hdk\working_jdktools\build\test_report
Run jdk/bin/javadoc in C:\cc\cc-common\build\checkouts\hdk\working_jdktools\build\test_report
Run jdk/bin/jarsigner in C:\cc\cc-common\build\checkouts\hdk\working_jdktools\build\test_report
Run jdk/bin/keytool -help in C:\cc\cc-common\build\checkouts\hdk\working_jdktools\build\test_report
Run jdk/bin/unpack200 in C:\cc\cc-common\build\checkouts\hdk\working_jdktools\build\test_report
Compiling TOOLS tests
Since fork is false, ignoring memoryMaximumSize setting
----------
1. WARNING in C:\cc\cc-common\build\checkouts\hdk\working_jdktools\modules\tools\src\test\java\org\apache\harmony\tests\tools\javah\Test\Test01.java
(at line 24)
private static final long xxx2 = 1;
^^^^
The field Test01.xxx2 is never read locally
----------
1 problem (1 warning)
TOOLS exclude list: C:\cc\cc-common\build\checkouts\hdk\working_classlib\deploy\build\jdktools.tools.exclude
Running TOOLS tests
test.jre.home=C:\cc\cc-common\build\checkouts\hdk\target\hdk\jdk\jre
The test report is in C:\cc\cc-common\build\checkouts\hdk\working_jdktools\build\test_report\html\index.html
The execution FAILED with the following exception:
The following error occurred while executing this line:
C:\cc\cc-common\adaptors\jdktools-test\adaptor.xml:24: The following error occurred while
executing this line:
C:\cc\cc-common\build\checkouts\hdk\working_jdktools\build.xml:242: The following error occurred
while executing this line:
C:\cc\cc-common\build\checkouts\hdk\working_jdktools\make\build-test.xml:97: There were test
errors.

***********************************************************
Unit Tests: (160)
        
error: testOwnedMonitors001 org.apache.harmony.jpda.tests.jdwp.ThreadReference.OwnedMonitorsTest
Unit Test Error Details:	(1)
                
Test: testOwnedMonitors001Class: org.apache.harmony.jpda.tests.jdwp.ThreadReference.OwnedMonitorsTestorg.apache.harmony.jpda.tests.framework.jdwp.exceptions.ReplyErrorCodeException:
Error 20: INVALID_OBJECT
	at org.apache.harmony.jpda.tests.framework.jdwp.VmMirror.checkReply(VmMirror.java:95)
	at org.apache.harmony.jpda.tests.framework.jdwp.VmMirror.getThreadName(VmMirror.java:699)
	at org.apache.harmony.jpda.tests.jdwp.ThreadReference.OwnedMonitorsTest.testOwnedMonitors001(OwnedMonitorsTest.java:114)
	at java.lang.reflect.VMReflection.invokeMethod(VMReflection.java)

***********************************************************
Modifications since last successful build:	(1)
            
add cc-hdk log20080206081803Lbuild.475 02/06/2008 08:18:03hdk

begin 644 execution_log.zip
M4$L#! H    ( #N$1CBZFP,/;!(  (E_   2    97AE8W5T:6]N7VQO9RYH
M=&UL[5W_<]NXL?_9F<G_@%[G3>T9B]%72U85=US;:9R+XSS+R;43I1F8A"3&
M%,$"I&U=WOWO;Q<@)9&4*%F&8R53S9U#@L!BL9_=Q7()@IUA./(..E?<&1]T
M L$..I3(<.RQEW_I<S\L2?=WUB:M\O_\]2\'SY]%@4-#5I(W?OOYL^?/2I*%
M45#ZZER'G'NR="MU<5PM6RXB;'8<!9YKPW6'!()_979(?#IBQ/6).PJX""WR
M/BZ_Y$'I+;MA'M8,F C'Q&%]UW=#E_M2'P.9OBMDB.V/VCW;AO]*-A^-N-^3
MMG"#4/;BUBZ3UMW((]1W"!U0[##?YBIR/:=G#YE]S2-H.W2N>[=<7+O^X$LR
MH-Z(7K,,51Q@R&0((R3X^\3L(?],GKU<\??L$AI#)R3IA%RY/A5(W;)6IX)L
MV!ZC?@F9D2480Q"%2OPV#\:EKX*5^J['-"+V<,2=;%E<K9V,J 1U(GU5#6QT
M[;CB,SD23($()^WUI*@K81=?!$/D'Z\#B8-1IUHN&92.^"AP/93^F_?'AR1N
M\6C,]&R/2LF2+K[2&VK/,E%M5HCDD; 94;B0D#]2GUW7QTZ@'7$EZ5-/LEWB
M#GPND(\1&W$Q/J-W[B@:=<$3$#!X5-(TD=+DERZO6.2WPXMWI^_^L;ZA:=7K
M?06/HL;1BUM'X 1Z7 QZ-*! HS>D HK'TXJRUQ?@5I!B[YA=18,!8Q=LX,J0
M"0L93/-*MFE(0/B,-%H[Z4M;(F[&'(LZSK834]OY*\E4_/>"7[K:Y3@ 0=(^
M"\=M<CED(.9PR,$E >WS*W1\.^2*>=P?*.!#J"'H+0FQV5O7OV;.6V#'(A>L
M#SP!?JK:@/E,N':V6N?D@,@ACSP':)* HDQ@*("ELQJ(B\JKFP(N^LWS0,T(
MQ;B6&UE@71]$X5/O_=23@[/<QNEHE]Q0+P*,5X3XWFAC1QKM7;(,]==4#L]H
M4 AY7*?SZ^['1T*\MBF(?W5N@]Y[:E^S\-B5 0VA1;%-5RKU+/805OCA_T8L
M8LJHU:FF>1_,35KV4ILV8,WU'Q?#:GT_[Y@AE$R,EMV24[#G 1/;6#[6Q*T!
M"T^=[9V=W0S=);\9$NOX@'5_C^,[0GKEL:7>0]4RX#\:/[".M7)^ CN&&P:M
M9*?.+HD+5M>*GP'3O1\7TUHC-^__%].B\N9&8?UQ=.8*P9?,[ZU:SG 5':DF
M=W6X'%QSD_FA$'2\=$:?U'KPM-[Z 2';+U>SD-U0H0&#@V*X?ERH]G\\J*J5
M:@ZJOLL\1X,E([AY.L+LPBM=&'(EKNV=3^[G]8.G'Q?B2OE'Q+A6A+$Z_)D]
MZ$(LGSB)I1",\U?BW#]F&*?TSGT0Y&U2_)9&OCU,DER%,._GXULT7')R9S.5
M0WG%14*6L+N0090TO4B^91KK>Z45K'>(J4/A4L_]':,74M"KPP%HGX?$85!+
M,((/)&@(D/==GWHQG8],2&CXX?28*-TDO*]5 M7I@9 _<6I+07Z"^0C94V[U
M@^]QZJR$;]Z(]3,5@J=6%+J>-<T-9LV9W ?. KJ82O;9#6 9R95]YA-GEQXB
M]/UF5NA7P ^C/@CB/ K/^V<JCTY>Z@3[ K&3)0+WN W:#Y&1JRPH37HB<<'H
MJA)_XES00R1>:5:R(@^B*P]\A*)$D) ZVNZ&ZDD&IG1W8(81_%;J.N]X^(I'
MOK/,N9%5)C;!PDCXV@%I#OI<Y+C8(7W!1VJ>F];,C/HHDB$?O84B --G#-PO
M.G= @3EPF^K?:+^',R&<02\C]7 (*77^=C"O TUK19UXXMS-PW0BEQ],Z03,
M'AN@$UDN-E\G%NK*$^>$4KK"1U>X%$"?ELM5?"A4K"WE\B*GS>X""$V/.#K<
M,*$)SGL;^V7.F0IBNR$54,=AI[[#[LC+EV3VZ@F G%S+1<US_?W*?G\^=VOX
M_X6X/G'^IPC7VE)<&[6<$Q#N#4B*3.!%6C%,=VYXP6SFWH A+9F="U&;AYL.
M2^>/8!$/*1@U\MYX1=B>. ?T,-B:>W.>S9*3?[X_.;H\.?YR\O'DW67WR]'Y
MAW>7 %2V_/#BXO!?EL?\03B<A]]ZEC:_=Y.6]L2YH,60+<4K_YSD)\*K^L3Y
MFP?@4JWD;P!_(F V(1FS'C"U>FY9T<\$S":E3.X'3#.?,HGO#_K4]2+!SIB4
M=,  E%_^_&?RZO#T[8>+$^)$JHX:$QZH&5W^B?SIEY6R*DNAR72^#B:;E%&Y
MY^R23U.NC\D&0;(0JDU*Q>2@.J)RR9UW+?>$';.P<;H_>Z>DVERB1"]PC0TN
MT'G'[L*/N-SN$.Y,_<'V_%NFM5S<7![6L:9-RHRL 5$KEZ,L@DC\0,@L1&R#
M\A.3A-+RO$0K%R<HH-0SO=/C!=B\TE>+X5GNX.(^3(*P"<F$RR$.9/(8L:>D
MM7P6JC=R*:*9-26XWE 1@IDILL/M6'B[*-2=37CJ_1&N<E'X^%17>;PEXIN0
MDI!P@?7>'/_V_@.T2'*J[P4'@<C?! V"96L":[F4$A6#FWB=BO>]UJE\/SBK
MFY"6>#AL^4Q@G)&/,^^?/N\H')/5*G B%^9J)[]U+3;I1<,,?6\$T/A>'7C^
MD23;<')+A0^"D3OXLE0 \PQ 4&)WMA<Y+//"E'I-*KX$\I;A_5Z*4H__/?>J
MY\!DQL=QW41[+%0&*Z8>OS@X][6MB\CWY[VTE5PG9+*JX,W'LY>K< CA"$RM
MZO K_B_8"XBU7DPU+4>;F:/]Z2N:QW1<8">6MA,KMA,M&C54"^W$^NB*,*+>
M&50"K;?B91$XMZ5)8HDD^ 8FJ>R25_I61K9)>9><X.(@?7CICAAA'@TD<]JD
M9>TW:D0R^^&DFE:ULF^,U'[3&*F]AC%2QBA5FE5C3)7KIDC5J\6Z4%N55+5B
M-??V"FE55Z55J5N-O4W44;CA,B:M>K58'^JKTJH#BF5CMF-03<MU8USMFQM@
MJU*L67LKR[T!&E_,UGTTWJ!1E_>-D=IKM8QI5MF8'=8;Y@983&EE*X1[XEK=
M&%<&257,(5@VYY3+37-<F7,SM>I&RLHD*4/>O665:^8F"G/*4&D4QR#W(54Q
MYMOK>X9<7\ND%ZT8#&[-B=W@Y%4MFPLB-U)4YAS#$F5_"A=C-A8UIU65NC%9
MU1K&C+EF3JO,S:<&I6Y0UPW>$!J4E4&U,NC832J#P9!O,X,K<Q'1LF38RHF&
M6L7::YJSG-H&)M8:!E74H#D;M,'F)OHKDX:S7TRJL;*V-T ;-C%AL:YKJ,Q3
MK'DS_4GW<I4'"YF'YM;YK<^<,PXTH#OD1RV[.CDVDJ1I&;* BD%KJBP2X)JT
M3$W:%8-W*\4&<)_[5F.B B]M+&%GSK$N2\$;=/?WR@0OF67O1<M4(%'=Q$B^
M7#%WUV,J>-LS&N@:"RG-D*F92V4UK&9K$S.(!N]9#3[$-'DGO9&R*M<6SJ3S
M0I+U%U.\YM[,&EL#,W?%JC4-34E[+:M5,212(%4UEG4V]ABP935-K?-H+7V4
M^Q0YH3T4EC&Y-TT]% 92)D=8-S59 E\-8X^D6J8>W[7,.<D]])*Q>WC^+.21
M/2S%[YQ(M3][>UK.%)&94C;9I[V]?/5>]_"L^XC+]R0=R9GU>]BOS7V;@ES>
M<>C6U1O=ZZW-<3-^GQ.?X=OS)&1WX2YQN-J?@8=#M=?X\@6 >D"J1KH"%EE?
M!;A\/F)K+M++=8E;]$]6[I%2LOW"NFME%VR##QW>,?LS.51S%GFMYRRB-WMB
M@K3)MKU#CG@P%NY@&)+*_CZH6K5<;JEUIW&S+N^'M[B+DMK8@JI-+;@@+FBG
MY]K,EZ!&NX0"#H'Z+ -N0)GN7PTR&>,O%:MAE7\AZ2J@;27J!4,*3.'.33#Z
MP&,APY[P&+H%NNDV\L;'EQGV*JU6H[%+ME^Q*T+V%/\[N^0WUW?XK7S!1GOU
M\,5(WMAPBU(&DU&;KQ,ELC2]81@&[1<ODJD]GNEATB^&SWYT_$YLSP4#)V]0
MCGJ/?T"O;#6; %?-JEDPJBF*IW\_@S,1H"#*"LZF10X]CZC+X%*89.*&.5;Q
ML(:/-9HW[TY+ZOL@9,C4?B3:BM7R9(KKEM/5TV<?\,6Y]KQ(+%[WBYQ;9_AE
MCD]<;^G^F73T7F&X6XL\**(^:9(N)J1TQ7FHJ( F#DD'_QXH(QFX$-X157KK
M@I!Q'36,FOD.^B*>)33_AZNW'=:GD1?&^YHAP4)! $\Y?O"W@"=<[?X=6.*D
M@V@>I$BA[B$Y_2&1"4N".:Y@-OILU[\/6S)@MMMWU6=;<KXFQY)#.KH?+L83
MOA*64AJ8,&;''^H '4IUMQJ'D\[([="UAWFJ?7"=^@4I?!&!BO&R$;@^6$:V
MFU-5&'^18T;UU-L-T V-0CX"KZGV_UC6 _BO*PX.)@L;;FLDX@D2/0#<R"SC
M-V5KL]14D*#VV,.=32+@BOP'[I0TD#.-5I.RQ.!$R?-JC-O[@2_(:L(%DZ"\
M$#T5^SF'VX_FZ8#\,9+7NQ&Z.*6A#('K,0N+V(+I9(#X/AICHJL[&#(OL.:Y
MV*TI$]]BK_@'>7-XH0)& KC1#%(S#5"?W/YX3L,BS8E;;<&/Q 0 6*3H8'N2
M;U^Z9F,)IL9()SGZHCSAEGHO44<J6N&2ZQD"JDR]$#.E@*= 096NT#I S9WM
M7TJ PP$*$^Z2LCSWD\8S[;9(LM\0E$_:DFUP'([;[T.HH??CFM/G3I9!)3T 
M1KOE+VA@V('Z6E8\MF()PU4%^/SV5O>5BKZM8XB=E1/-0ZH<RY8:%;]QX6:!
M.H[Z^A;UXADAUZ4'-I)N D-FM\D$ F<!ES(?$)9L)B# 41KDN#+PZ)A@$?@8
MW.E*DNT(>+EU85Y,5!2Y3[C,2B^4E'0NNX=?/ER\/4":*:6"&R]0 #H*T-4.
MN7##<;X]]JYIX-$793:SFJ$*$B2@VBR[&6H@B[LQZ0PYV#2($*(X>?"MW4'C
M/OA#B0HNJ\@.K!HJD;B2&B+6VB7,&EBZHJ4K6N!3VI5JK3ZO+VT6^'>"^ZQ-
MI#K<?GUY^1YC]>[YT:_=K"!C&(7V\GJ&0')3KX]$;3$.0CX0-(!Y4Q&&NXM$
M!<0"DJIQ)^$O*54TL]8FY[-Q+R[4!GPCZM,!3HD+W,*TIS1W4W]0P"88G"D^
M<5;0VHXV3D/, BSN+<WKI$4ALZBMYKF=-=F"#F<9GFU3R/'(,<_O*-[.PW$'
MJ?1!ML>TA-.M%C"="PU AW"&)R6<N!\K/$B?_1IW&:FX('TM8>=;J1-_ $/[
MBC]F2W04@&4=??A%?1CKX _+LDCI30>CL*12(2,^O_63#VW(#"=;2C<$^\_6
MUC_TG21+*05<B28I^)E&*"A;>%M;1WB4GBX$NTD\/NX?'64CGI+>.3.$QOI@
M:N(A![_+PZ%6%@C$LTT=AND-F%4NV(C?, )3'MPRJ(E]OEO9*K$[A J:G*B#
MU/"P/S4#HQ.6H<.ST^I6"6ZP@3(T[S*X%U&\8F4=9+@BN0&'T69;HJY!N\LA
M!+)*[Q+=Y3J )" @F@"3;:QW>8;FIWJ[9YKB>]L>PKWZ#E*BY*A[H?>FR-( 
M'FV/^R"NR:<_H3IRKL0VI[H*B1Q$E?J#="25K0W1EA_:"L;W>(BRU!+,\*K 
MR<=(6R7)O+XF,%$]B%RA, [ 4E24RYAD,(&Q'+4DJDSS7Q1*;DUCYX])Y#S;
MIQ)RD6F]1A2+#%S[FV\9*\^DJ2"\:&]EFFBM6]!WSKU%/MS(75?+Y<=R;7'^
MB$P[^E0"UX.>Z/](J:2]T$OEGSYCX9V%]3Y9@]\_D[$%D72:W/8KC <0&-?7
M=@[-=_&>>::'DI+$SKPD^RK?$[T\/W_;37U0-'[Y?EJE\=]O?:;VC-!G4MAZ
MXPCL8-Z.$7JDNK)*'*HO0:H_Y<J2+\DMVB,V]:$!M>_.W=U=E;PDE:4;0TQ^
M\[?:T;O!QLPIH@_9ZS79MX%L5Y)=&U;8M$'KXJ,]]M%_O^=CGYQQF7_LL\(J
M@NGH\3L(,EY0 (%7%YV^WFJ[2P'IPE4$*R_5VC>W_*]:6;+8;F6FRM/UP@]]
M=*FCNA+XJ1(;!>%8%\:YT9FB? GF)4MZWH!S/1Q]"H,2U)=Z:W1@O$T:K<;^
M**,U:*?(#=&-T$*-360]_,YZS\5-SBP\1'[E$"Y,&7[^#*;;V5,M""4?H=.A
MSY\]0R9Q^HI49*L7O.BP1*5F.>9]U>:'R99C;=5DY@+*GW#;CH0 T[L=NMZ$
M(EP.,4Y$-PF=98=.'1K@\M^)S2OFDF+\"GJ[6M?;WACI;W51QWU7OW?GZD/P
MTSA L;'?5%Q 6'&+?Y1&::6W -3."WK0>0&.&OY><6<,_Z ^'/P_4$L! A0#
M"@    @ .X1&.+J; P]L$@  B7\  !(              *2!     &5X96-U
C=&EO;E]L;V<N:'1M;%!+!08      0 ! $    "<$@     ! 
end


Mime
View raw message