harmony-alerts mailing list archives

Site index · List index
Message view « Date » · « Thread »
Top « Date » · « Thread »
From nom...@intel.com
Subject [build-test alert] FAILED Linux x86_64: drlvm debug
Date Mon, 04 Feb 2008 12:41:21 GMT

BUILD FAILED:
	Ant Error Message:
/export/users/cc/cc-short/scripts/cc-exec-adaptor.xml:104: The following error occurred while
executing this line: /export/users/cc/cc-short/adaptors/drlvm/adaptor.xml:34: exec returned:
1

Date of build:	2008-02-04 18:39:48 +0600
Time to build:	1 minute 17 seconds
Last changed:	02/04/2008 18:33:29
Last log entry:	classlib

***********************************************************
Errors/Warnings:	(3)
            
svn: PROPFIND request failed on '/repos/asf/!svn/vcc/default'
svn: PROPFIND of '/repos/asf/!svn/vcc/default': 504 Gateway Time-out (http://svn.apache.org)
The execution FAILED with the following exception:
The following error occurred while executing this line:
/export/users/cc/cc-short/adaptors/drlvm/adaptor.xml:34: exec returned: 1

***********************************************************
Unit Tests: (0)
        
No Tests Run: This project doesn't have any tests

***********************************************************
Modifications since last successful build:	(1)
            
add cc-classlib log20080204183329Lbuild.571 02/04/2008 18:33:29classlib

begin 644 execution_log.zip
M4$L#! H    ( "F51#B)I*TI,P$  . !   2    97AE8W5T:6]N7VQO9RYH
M=&UL?5'/2\,P%+[WKW@>I'IHL^DF(];"8$X&HD-V$P\Q?5T#:5.3EW;SKS>M
M#,3#<LO[?N1]^;**:IUGGZ8XYEEK,<\$.#IJ?(A+TU#BU#=R6$PN[^,\\FTA
M"!/7-3R"X;SC >4'+ DL=LHIT\#=='$SOTNCR/I_K$$&V[?7[7KSL@J"+X^.
MH!1*8P%!&3.+K7%,N))=!#+KI&0%EL)KBL\XF?*\E,-\,H.GL'DOCK!3-2;&
M$UQ51"UG+-!3T0I986KL_CJ*=A7"\(ZG(<]ZN7E^7$&OJ (*2&FT-KUJ]H$C
ML1TX?)3\ :PU%HR4WMH0K:]"PI-C@*E2#K1JD$<,#ZVQQ+Q#ZUC86<K$5<-$
M%*(E$X:%U5U]NJ:'6O/;&1_=PA>2MPT6'*91QD2>L;% ]ELF&YO] 5!+ 0(4
M PH    ( "F51#B)I*TI,P$  . !   2              "D@0    !E>&5C
D=71I;VY?;&]G+FAT;6Q02P4&      $  0!     8P$      
end


Mime
View raw message