harmony-alerts mailing list archives

Site index · List index
Message view « Date » · « Thread »
Top « Date » · « Thread »
From nom...@intel.com
Subject [build-test alert] FAILED Linux x86: ega (Eclipse x 48h)
Date Fri, 01 Feb 2008 08:52:08 GMT
svn.revision=616841
BUILD FAILED:
	Ant Error Message:
/export/users/cc/cc-EGAx48/scripts/cc-exec-adaptor.xml:104: The following error occurred while
executing this line: /export/users/cc/cc-EGAx48/adaptors/ega/adaptor.xml:58: EGA scenario
failed.

Date of build:	2008-02-01 14:35:45 +0600
Time to build:	16 minutes 16 seconds
Last changed:	02/01/2008 14:05:52
Last log entry:	snapshot

***********************************************************
Errors/Warnings:	(203)
            
[exec] Result: 25
[echo]
[echo]
[echo] ========================== EGA.log =======================
[echo]
[echo] --- Automated EGA scenario for Eclipse 3.2.1 ---
[echo]
[echo]
[echo] Eclipse Home = /export/users/cc/cc-EGAx48/build/libs/eclipse-3.2.l-lnx-x86/eclipse
[echo] Tested JRE Home = /export/users/cc/cc-EGAx48/build/checkouts/snapshot/hdk/jdk
[echo] OS_ARCH = x86
[echo]
[echo] Tested JRE options for Eclipse launching = -showversion -Xmx600M -Xms512M
[echo] Tested JRE options for debug step =
[echo]
[echo] Time frame for the scenario run = 48 hours
[echo] Delay factor = 2
[echo] Kill Eclipse if EGA scenario fails = 1
[echo] Start:
[echo] 	Run Eclipse
[echo] 	Select workspace
[echo] 	wait window 'Workspace Launcher' to appear ...
[echo] 	window 'Workspace Launcher' (23068765) appeared
[echo] 	Select /export/users/cc/cc-EGAx48/tests/ega/workspace as workspace
[echo] 	Press 'OK' button
[echo] 	wait window (23068765) to close ...
[echo] 	window (23068765) successfully closed
[echo]
[echo] Prepare Eclipse environment:
[echo] 	Close Welcome page
[echo] 	wait window 'Java - Eclipse SDK' to appear ...
[echo] 	window 'Java - Eclipse SDK' (23069270) appeared
[echo] 	Uncheck Project->Build Automatically
[echo] 	Select Window->Preferences
[echo] 	wait window 'Preferences' to appear ...
[echo] 	window 'Preferences' (23070898) appeared
[echo] 	Select Java->Build Path->Classpath Variables
[echo] 	Create M2_REPO variable
[echo] 	wait window 'New Variable Entry' to appear ...
[echo] 	window 'New Variable Entry' (23072170) appeared
[echo] 	Set M2_REPO value to /export/users/cc/cc-EGAx48/tests/ega/project/.m2/repository
[echo] 	Press OK button
[echo] 	wait window (23072170) to close ...
[echo] 	window (23072170) successfully closed
[echo] 	Press OK button to apply new preferences
[echo] 	wait window (23070898) to close ...
[echo] 	window (23070898) successfully closed
[echo] 	wait window 'Java - Eclipse SDK' to appear ...
[echo] 	window 'Java - Eclipse SDK' (23069270) appeared
[echo]
[echo] Import geronimo modules into workspace:
[echo] 	Select File->Import...
[echo] 	wait window 'Import' to appear ...
[echo] 	window 'Import' (23074882) appeared
[echo] 	Select import existing project
[echo] 	Type path to search projects: /export/users/cc/cc-EGAx48/tests/ega/project/geronimo-1.2-beta/modules
[echo] 	Uncheck all builders
[echo] 	Import
[echo] 	wait window (23074882) to close ...
[echo] 	window (23074882) successfully closed
[echo]
[echo] Import testsupport module into workspace:
[echo] 	wait window 'Java - Eclipse SDK' to appear ...
[echo] 	window 'Java - Eclipse SDK' (23069270) appeared
[echo] 	Select File->Import...
[echo] 	wait window 'Import' to appear ...
[echo] 	window 'Import' (23088194) appeared
[echo] 	Select import existing project
[echo] 	Type path to search projects: /export/users/cc/cc-EGAx48/tests/ega/project/geronimo-1.2-beta/testsupport
[echo] 	Import
[echo] 	wait window (23088194) to close ...
[echo] 	window (23088194) successfully closed
[echo]
[echo] Start repetable part:
[echo]
[echo] -------------------- Iteration 1 start ------------------
[echo]
[echo] Clean all Geronimo modules:
[echo] 	wait window 'Java - Eclipse SDK' to appear ...
[echo] 	window 'Java - Eclipse SDK' (23069270) appeared
[echo] 	Select Project->Clean...
[echo] 	wait window 'Clean' to appear ...
[echo] 	window 'Clean' (23092153) appeared
[echo] 	Uncheck start build immediatelly
[echo] 	wait window (23092153) to close ...
[echo] 	window (23092153) successfully closed
[echo]
[echo] Build all Geronimo modules:
[echo] 	wait window 'Java - Eclipse SDK' to appear ...
[echo] 	window 'Java - Eclipse SDK' (23069270) appeared
[echo] 	Select Project->Build All
[echo] 	wait window 'Building Workspace' to appear ...
[echo] 	window 'Building Workspace' (23093260) appeared
[echo] 	wait window (23093260) to close ...
[echo] 	window (23093260) successfully closed
[echo] 	wait window 'Java - Eclipse SDK' to appear ...
[echo] 	window 'Java - Eclipse SDK' (23069270) appeared
[echo]
[echo] Open Navigator view:
[echo]
[echo] Fix org.apache.geronimo.common.propertyeditor.PropertyEditorsTest:
[echo] 	Select 'Navigate->Open Resource'
[echo] 	wait window 'Open Resource' to appear ...
[echo] 	window 'Open Resource' (23101254) appeared
[echo] 	Type PropertyEditorsTest.java into 'Open Resource' dialog
[echo] 	wait window (23101254) to close ...
[echo] 	window (23101254) successfully closed
[echo] 	wait window 'Java - PropertyEditorsTest.java - Eclipse SDK' to appear ...
[echo] 	window 'Java - PropertyEditorsTest.java - Eclipse SDK' (23069270) appeared
[echo] 	Go to line 'protected void setUp() throws Exception {'
[echo] 	wait window 'Go to Line' to appear ...
[echo] 	window 'Go to Line' (23106702) appeared
[echo] 	wait window (23106702) to close ...
[echo] 	window (23106702) successfully closed
[echo] 	wait window 'Java - PropertyEditorsTest.java - Eclipse SDK' to appear ...
[echo] 	window 'Java - PropertyEditorsTest.java - Eclipse SDK' (23069270) appeared
[echo] 	Add line Class.forName("org.apache.geronimo.common.propertyeditor.PropertyEditors");
to setUp() method
[echo] 	Save PropertyEditorsTest.java
[echo] 	Close PropertyEditorsTest.java
[echo] 	wait window 'Java - Eclipse SDK' to appear ...
[echo] 	window 'Java - Eclipse SDK' (23069270) appeared
[echo]
[echo] Run JUnit tests from geronimo-common module:
[echo] 	Select geronimo-common module
[echo] 	Open Run->Run
[echo] 	wait window 'Run' to appear ...
[echo] 	window 'Run' (23111059) appeared
[echo] 	Create new JUnit run configuration
[echo] 	Run
[echo] 	wait window (23111059) to close ...
[echo] 	window (23111059) successfully closed
[echo]
[echo] Modify GBeanData class from geronimo-kernel module:
[echo] 	wait window 'Java - Eclipse SDK' to appear ...
[echo] 	window 'Java - Eclipse SDK' (23069270) appeared
[echo] 	Select geronimo-kernel module
[echo] 	Select Navigate->Go Into
[echo] 	Open GBeanData.java
[echo] 	wait window 'Java - GBeanData.java - Eclipse SDK' to appear ...
[echo] 	window 'Java - GBeanData.java - Eclipse SDK' (23069270) appeared
[echo] 	Select Edit->Find/Replace...
[echo] 	wait window 'Find/Replace' to appear ...
[echo] 	window 'Find/Replace' (23118699) appeared
[echo] 	Find getAbstractName() method
[echo] 	wait window (23118699) to close ...
[echo] 	window (23118699) successfully closed
[echo] 	Add System.out.println("Method getAbstractName() was called!");
[echo] 	Save Class.java
[echo]
[echo] Create JUnit test:
[echo] 	Open geronimo-kernel/src/test/java/org/apache/geronimo/gbean folder
[echo] 	Select File->New->JUnit Test Case
[echo] 	wait window 'New JUnit Test Case' to appear ...
[echo] 	window 'New JUnit Test Case' (23125436) appeared
[echo] 	Enter SimpleGBeanDataTest as test name
[echo] 	Enter org.apache.geronimo.gbean.GBeanData as class under test
[echo] 	Press Next button
[echo] 	Enter getAbstractName() as method under test
[echo] 	Press Finish button
[echo] 	wait window (23125436) to close ...
[echo]
[echo] ERROR: Failed to close (23125436) window during 200 sec!
[echo]
[echo] Print error screen picture:
[echo] 	Picture was saved to /export/users/cc/cc-EGAx48/build/results/ega/20080201_0235/error.xwd
[echo] 	Please, use command 'xwud -in ./error.xwd' to view the error screen picture
[echo]
[echo] Kill Eclipse:
[echo] 	Found 1 Eclipse processes
[echo] 	Process 0:
[echo] 	Eclipse process was killed
[echo]
[echo]
[echo] EGA FAILED!
[echo]
[echo] ======================= eclipse.log =======================
[echo] Apache Harmony Launcher : (c) Copyright 1991, 2007 The Apache Software Foundation or
its licensors, as applicable.
[echo] java version "1.5.0"
[echo] pre-alpha : not complete or compatible
[echo] svn = r616841, (Jan 31 2008), Linux/ia32/gcc 4.1.0, release build
[echo] http://harmony.apache.org
[echo] Install location:
[echo]     file:/export/users/cc/cc-EGAx48/build/libs/eclipse-3.2.l-lnx-x86/eclipse/
[echo] Configuration file:
[echo]     file:/export/users/cc/cc-EGAx48/build/libs/eclipse-3.2.l-lnx-x86/eclipse/configuration/config.ini
loaded
[echo] Configuration location:
[echo]     file:/export/users/cc/cc-EGAx48/build/libs/eclipse-3.2.l-lnx-x86/eclipse/configuration/
[echo] Framework located:
[echo]     file:/export/users/cc/cc-EGAx48/build/libs/eclipse-3.2.l-lnx-x86/eclipse/plugins/org.eclipse.osgi_3.2.1.R32x_v20060919.jar
[echo] Framework classpath:
[echo]     file:/export/users/cc/cc-EGAx48/build/libs/eclipse-3.2.l-lnx-x86/eclipse/plugins/org.eclipse.osgi_3.2.1.R32x_v20060919.jar
[echo] Debug options:
[echo]     file:/export/users/cc/cc-EGAx48/tests/ega/.options not found
[echo] Time to load bundles: 166
[echo] Starting application: 7532
[echo] Application Started: 30267
[echo]
[echo] ===========================================================
BUILD FAILED
/export/users/cc/cc-EGAx48/tests/ega/build.xml:464: EGA FAILED!
Total time: 16 minutes 15 seconds
The execution FAILED with the following exception:
The following error occurred while executing this line:
/export/users/cc/cc-EGAx48/adaptors/ega/adaptor.xml:58: EGA scenario failed.

***********************************************************
Unit Tests: (0)
        
No Tests Run: This project doesn't have any tests

***********************************************************
Modifications since last successful build:	(1)
            
add cc-snapshot log20080201140552Lbuild.80 02/01/2008 14:05:52snapshot

begin 644 execution_log.zip
M4$L#! H    ( (%V03B@BWUU-@L   P_   2    97AE8W5T:6]N7VQO9RYH
M=&ULY5M[;]LX$O][\RFX!0Y)@4JRG,1QO*F!;!YM^DK@M-<#BB)@)-I6(XF"
M2/G1^_(W0TJ._) L>;UMNF<4A1UQAC/#W[Q(ZF0H [][<L_=:?<DBEGWA!(A
MISY[N=OGH32$]YUU2+OQKS]VNSM)Y%+)##$*.SL[<0+_$_Q\^49']"OY,_%\
MM^_Y,/X>OYJ3P)\;,/=CB5Q_9\Z0?R4&?D@O"<G%JU,B'!;2V..$AT0.&>ES
MW^=C+QP0AX=];Y#$5'KP3%$5\OS(A&0N>=.[("^)Q281CZ65"!8+RW'@GP%3
M30[:EI+=<H;,>>")%)8(:22&7%I#]\'ZYCX43G#A^%XD&'G- U9E"M^[%Q;3
M1,:^V31]PP\GQJ3=ROY:;+W\O+>9>3S)4DN$27#/8A"BL9X*%H)(3XE\T"X<
M?LY\.B5]ZDB.?)N% ]]ZOC\SA==_7+P^]7P!I'8UK7++Q2-42L"ZQS/./DU"
M9X@8>$D,6)[Q"*RL0/"?8-)J--[C%W%H-]_7G@$0Y[+[9 !^P")@7X[2#3_%
M1E#(,VDBN2<[ZX;A][6#4C15'6>FIEP[?A28J>'*AO(@@IA@2K"VZ?A4B)5N
M/V'.5W(:4>!,7M,XX.&4O%-K##CND#WG.3GCT33V!D-)[.-C^P5I-AI'Y".,
M3\EN>5^.:<S()4]"5SL"K*<G!?$]0*'@L7A!J" TBN /]!ZD*A0%_T(R3#VS
MS4.S\6PE$M1H")P&]:,A!5%#+I72/I,,Y\?O( S,5D@. 15P%K?L5OL %-M[
M0T.R;Z."[><OR#LO3":61_>;UL!QR(%IFXT7)&8^H^ (*I84<AY*&74L:Z@M
M:E)E*9/'@PIKJYQ@>RNL7.8,A [1:S,_GH_@IKFT(E]<AI94$8A))'6]F&$8
MFFXCQ%IS EA@F9D;<#'PGHXT#H^9";$:0_73D4I7!#]7'E,PB9.(M6)T_H;9
M]2_3"[UB#]%6RBVE(H$*IL2K5M. +$O.]660A-^]" J0241#%\V]5DT:.\.9
MFK?G;Y6JMN%CJ#$&\L&4-#8'WXGD]7C=R2!"VJ4 \ 602^.<C!768A5CXH55
M9"I>QFV I)+&6<CKL8"/\B%OS.,' 8&8;3'<8>P%A0?4FG$OCL$QHXISS$3B
M0W9\G&&%0.1+\  #4C*HE^!'!1.EO)5(F,<:S89]UVCN'Q87I&!$.5?O%PZ]
M4:GO!1&,_05)+!AF^GR@JCZ72:Q/"Q-I3W'ID&:Q A>]WG6O0RZ!#Y@)4.KX
M')9[K[EO-P\/]EO/"7B\R\?$36(T/P@#&CB_$RJ)B>+=99!2SFA&/M0M(2-'
M[999'"<BX"5-+*[-@ E!!ZPX^Q8^*'[RLO!#,O,5/:\O!C9]IU#X!@IH<ZU?
MOO97YE&#ZT_QL[JW_%2YQJ/J;!NTH]>W=Z>]L]? ?4746V^/G]9_5>N]BKEB
M*]N/*?X/W'"_0.1;7>QRR9 GL2CFL=CL%H]<[';G,9MUO"6].P:]3O'SW]0>
M2,J_>-0M) M'YC)+\= Q]606B'8_SPBR7FL7 Q<T2 Q2[:IL\,BGA 6$O$:K
M?=0Z?)ZR8BL[E#G9ZR4W;..J:'L#T5^0W>NWN] H20GXK&:9G :S0%[%'#DZ
MD3@.3-Y/?'^J.;@;P!D4B+"GS3# PI$7\S!@82ELSI3$GYGO8(")("M4A<0;
M;'R-V7Q0&]:&Q"H6RC#'S:-&%4A\"E6\ ^7Y-\"&T55;BUEJ@-8=3;H649^5
M.$873-AG,0MA-:H:(4=26_LY6E3[J-$^;M?P!#1?IO(-E4.C>X9-=01?R;\A
ML.#&19DFNE C[YMWO8N;:S)*2:KJ_H&-9].0BU#&T]HF6,5"6:)I5P/ +9,Y
M^?V$K6E$'B-$I"%CF4$3*K^("T\5MNLBQ/7;-#Y4#P^I,K7#0TI7*SPL2IDN
M"%"&8.JH-L!SL*POOZ:K)_]3"S&%#ZX"Q!@9, BR7L!)P-T$W4VUG;.,4Q9Z
M4R^^A"[ Z&IVH%)5VVB"VO;(R-0"';3;S1KQQM,JLXDG5%N8NE")Q!^G$285
MB$<@IF#8#F=4HK0W7/;3S-"&;3:->VC"K,SBZ],#I &]_<G*BKG?TB6MX1G:
M@/4]0]-M)_&G4BN+)9'ZKBU3 XI/S>M^OF^TV_;QP:_K&WDT;!'PJ55J SZE
MVP[@]?X/Y&Q0%.N&J+PSJG4J1ZYF1Z,VM)8XT9HCN4I3J=,,%89>+>2+7]$K
M9]6V4JN&7ZKQM<5.J5#2XZ9]N%^G,=!+J&(_N&C 7 \JWO*F8!'SZ9RU,9_2
M;0?SNLC_QP$H;== K8I** *,K[/=A-I*K&*AUFN_V:JDQ!) -&%]@&BZ?VA]
M?!VQD'R@(V] <7-LY+'Q)D'ZTIL0/$=,#Z2S3&<Z/ AX:$(&C%@LI^#8,(MY
MD_Z\4#\%;AQ6J,!W4S&AU%!2]YC@28RXJ+@."U0UEV"!&H\!&G@04 6+JHA8
MH;6Z[Z$+P$7^$ )Q,[XROC-AZN([H_OK^"[4;RO0K\J]5J![Q5$:=2JS"QB5
M #-0>\0]%TH]^2G: WL.8SX6Y&+B,+6I3?Y;&6^:^SO@7EOI/*E:I-91HU(/
MN(0*35@?%9KN_Q(5IZZK,:'VZ<P^CS_0@.T]VSC /7O^A^X>-*0")H>\S(ZW
M=%02+M;M$F] ^,ND*SP^>?,I]-)&FO1C'LPV=PR]&&G)52&CK"8LH=,Q.@F-
M+@I2T9XPM+8!%0WZH6TW#H^K@#;=)<;]0VT@/!R;OXU5?BI5/::D,M6.*2G=
M=DKM]]SU^E/RZD_H.LZII$3=5%L Q .+0^97 ,13<X EA,YILA[9CZ429)(K
MJ"_68'IFQDTBQ0+Q5BQ7SG,34V(X-+J7,(W58Y$/#46Y/'E%\U2U-9HG5H[0
M;AU7<FHD!0S(TWLA8^I(E8<J)) EC]43UO=835>O"L#T>3L5D@4F3Z2I+K3X
MX=ZS]UKJ977&5! \ V3N[Y@IU^1%G93+85J\PZ.CY&,**0L*RC,6/- 2L:.V
M[2PDP+N3EBX)9KM[UN >=Y'Z'/>Q*VZ=?F!CHZN%PG1-SFCI]8"E\[T%THT.
M^)9XY"XZK4?J12A93&X]O"<]\UW%#!87[45"O,*QCL&J$DO9TWP,](@6%>N3
M$"RLF:\[:?O )G+]C0$MPS) 8<;4Y6I,";[KB6'M:PJ9R2OY:N&#C>^NU9_J
M!OV;L#CF,1%.S,!G(L^125R:<&_T$.7[ MS:K70UM?CNGYK?G(Q+#UW3:X:)
MNJ<>!!2"Z^YDG+C$\$*\LI?Q4/Z#6R'JNM$JU3:P4_YJ49EEU-L.Q)XE/&@M
M,/B6GJ#=Z#&D4<9X@:$R_8.'87>K]^Y>G9++TZMW%^<E8*I_09%D%Z<WNJ'X
M-%Y$4:*HQ%7E110U>O,7413YW_(BBN)<[464/,55*"3NC/O<428LOM:*'_7>
MX39N]Q>7 G.]D9KOQTA4]+X!6(:Z)3EV7N ?;,9YH8OW@?&B)IYE:_F8^X/$
MB_QDX(5BZ7V?].IU;[\YN1L![%N-8_L8BL?BPNQ1 R>[I?7+Z7"NKMRN?-.K
MKO2/I]C9FV,J#O4Q$A8R5G=V<6,5  UQ)'35 9C=*KZVK Z+L1!)0ZA"-CDZ
MW"]^,?7T<:0F!["1_4:S=52L<-VL4^4SQW/NQY^?KMZ=I\EP[D$E>\_>N>X<
MM XZ^;Q:/.-'#B%6O?V+YB8!!'A@2.Q#+.YXZ,Z_#Z%:[>Q%"'MG!U,>OAV1
M*)OJR:!.Q*L/<V]ILVPOO*-(<@]4I<0=)XFA62#C(8 KXPB/Y= 3:F.ULU-B
M >K2"/<ME1'2'\H,A^W.\GULYIH[)Q;MGECJ97=+O_ANJ;?@_P=02P$"% ,*
M    " "!=D$XH(M]=38+   ,/P  $@              I($     97AE8W5T
B:6]N7VQO9RYH=&UL4$L%!@     !  $ 0    &8+      $! 
end


Mime
View raw message