harmony-alerts mailing list archives

Site index · List index
Message view « Date » · « Thread »
Top « Date » · « Thread »
From nom...@intel.com
Subject [build-test alert] FAILED Windows 2003 x86: jdktools-test debug
Date Thu, 31 Jan 2008 14:28:41 GMT

BUILD FAILED:
	Ant Error Message:
D:\cc\cc-common\scripts\cc-exec-adaptor.xml:104: The following error occurred while executing
this line: D:\cc\cc-common\adaptors\jdktools-test\adaptor.xml:28: The following error occurred
while executing this line: D:\cc\cc-common\build\checkouts\hdk\working_jdktools\build.xml:242:
The following error occurred while executing this line: D:\cc\cc-common\build\checkouts\hdk\working_jdktools\make\build-test.xml:97:
There were test errors.

Date of build:	2008-01-31 20:04:15 +0600
Time to build:	24 minutes 19 seconds
Last changed:	01/31/2008 16:48:46
Last log entry:	hdk

***********************************************************
Errors/Warnings:	(230)
            
Result: 1
[cc-ant]: Test Suite 'jdktools-test' execution. Repository updated: ${repository.updated}
[cc-ant]: Check for 'run' failure of hdk = ${hdk.parameters.run.failed}
[cc-ant]: Result: failed.superiors = '${failed.superiors}'
========================================
Testing jdktools binaries...
========================================
Compiling JPDA tests
Since fork is false, ignoring memoryMaximumSize setting
----------
1. WARNING in D:\cc\cc-common\build\checkouts\hdk\working_jdktools\modules\jpda\test\common\unit\org\apache\harmony\jpda\tests\framework\DebuggeeRegister.java
(at line 58)
registered.add(debuggee);
^^^^^^^^^^^^^^^^^^^^^^^^
Type safety: The method add(Object) belongs to the raw type LinkedList. References to generic
type LinkedList<E> should be parameterized
----------
----------
2. WARNING in D:\cc\cc-common\build\checkouts\hdk\working_jdktools\modules\jpda\test\common\unit\org\apache\harmony\jpda\tests\framework\TestOptions.java
(at line 505)
internalProperties.put(name, value);
^^^^^^^^^^^^^^^^^^^^^^^^^^^^^^^^^^^
Type safety: The method put(Object, Object) belongs to the raw type HashMap. References to
generic type HashMap<K,V> should be parameterized
----------
----------
3. WARNING in D:\cc\cc-common\build\checkouts\hdk\working_jdktools\modules\jpda\test\common\unit\org\apache\harmony\jpda\tests\framework\jdwp\PacketDispatcher.java
(at line 114)
eventQueue.add(eventPacket);
^^^^^^^^^^^^^^^^^^^^^^^^^^^
Type safety: The method add(Object) belongs to the raw type List. References to generic type
List<E> should be parameterized
----------
4. WARNING in D:\cc\cc-common\build\checkouts\hdk\working_jdktools\modules\jpda\test\common\unit\org\apache\harmony\jpda\tests\framework\jdwp\PacketDispatcher.java
(at line 249)
replies.put(new Integer(replyPacket.getId()),
replyPacket);
^^^^^^^^^^^^^^^^^^^^^^^^^^^^^^^^^^^^^^^^^^^^^^^^^^^^^^^^^^^^^^^^^^^^^^^^^^^^^^^^^^^^^^^^^^^
Type safety: The method put(Object, Object) belongs to the raw type Hashtable. References
to generic type Hashtable<K,V> should be parameterized
----------
5. WARNING in D:\cc\cc-common\build\checkouts\hdk\working_jdktools\modules\jpda\test\common\unit\org\apache\harmony\jpda\tests\framework\jdwp\PacketDispatcher.java
(at line 284)
commands.put(Id, command);
^^^^^^^^^^^^^^^^^^^^^^^^^
Type safety: The method put(Object, Object) belongs to the raw type Hashtable. References
to generic type Hashtable<K,V> should be parameterized
----------
6. WARNING in D:\cc\cc-common\build\checkouts\hdk\working_jdktools\modules\jpda\test\common\unit\org\apache\harmony\jpda\tests\framework\jdwp\PacketDispatcher.java
(at line 355)
commands.put(Id, command);
^^^^^^^^^^^^^^^^^^^^^^^^^
Type safety: The method put(Object, Object) belongs to the raw type Hashtable. References
to generic type Hashtable<K,V> should be parameterized
----------
----------
7. WARNING in D:\cc\cc-common\build\checkouts\hdk\working_jdktools\modules\jpda\test\common\unit\org\apache\harmony\jpda\tests\framework\jdwp\VmMirror.java
(at line 1834)
frames.add(frame);
^^^^^^^^^^^^^^^^^
Type safety: The method add(Object) belongs to the raw type ArrayList. References to generic
type ArrayList<E> should be parameterized
----------
8. WARNING in D:\cc\cc-common\build\checkouts\hdk\working_jdktools\modules\jpda\test\common\unit\org\apache\harmony\jpda\tests\framework\jdwp\VmMirror.java
(at line 1902)
vars.add(var);
^^^^^^^^^^^^^
Type safety: The method add(Object) belongs to the raw type ArrayList. References to generic
type ArrayList<E> should be parameterized
----------
9. WARNING in D:\cc\cc-common\build\checkouts\hdk\working_jdktools\modules\jpda\test\common\unit\org\apache\harmony\jpda\tests\framework\jdwp\VmMirror.java
(at line 2122)
fields.add(superClassFields.toArray()[i]);
^^^^^^^^^^^^^^^^^^^^^^^^^^^^^^^^^^^^^^^^^
Type safety: The method add(Object) belongs to the raw type ArrayList. References to generic
type ArrayList<E> should be parameterized
----------
10. WARNING in D:\cc\cc-common\build\checkouts\hdk\working_jdktools\modules\jpda\test\common\unit\org\apache\harmony\jpda\tests\framework\jdwp\VmMirror.java
(at line 2132)
fields.add(field);
^^^^^^^^^^^^^^^^^
Type safety: The method add(Object) belongs to the raw type ArrayList. References to generic
type ArrayList<E> should be parameterized
----------
----------
11. WARNING in D:\cc\cc-common\build\checkouts\hdk\working_jdktools\modules\jpda\test\common\unit\org\apache\harmony\jpda\tests\jdwp\DebuggerOnDemand\OnthowDebuggerLaunchDebuggee.java
(at line 94)
class ExceptionForDebugger extends Exception {
^^^^^^^^^^^^^^^^^^^^
The serializable class ExceptionForDebugger does not declare a static final serialVersionUID
field of type long
----------
----------
12. WARNING in D:\cc\cc-common\build\checkouts\hdk\working_jdktools\modules\jpda\test\common\unit\org\apache\harmony\jpda\tests\jdwp\Events\ClassUnloadDebuggee.java
(at line 32)
import java.util.LinkedList;
^^^^^^^^^^^^^^^^^^^^
The import java.util.LinkedList is never used
----------
13. WARNING in D:\cc\cc-common\build\checkouts\hdk\working_jdktools\modules\jpda\test\common\unit\org\apache\harmony\jpda\tests\jdwp\Events\ClassUnloadDebuggee.java
(at line 97)
boolean isOutOfMemory = false;
^^^^^^^^^^^^^
The local variable isOutOfMemory is never read
----------
14. WARNING in D:\cc\cc-common\build\checkouts\hdk\working_jdktools\modules\jpda\test\common\unit\org\apache\harmony\jpda\tests\jdwp\Events\ClassUnloadDebuggee.java
(at line 171)
public Class loadClass(String name) throws ClassNotFoundException {
^^^^^
Type safety: The return type Class for loadClass(String) from the type ClassUnloadDebuggee.CustomLoader
needs unchecked conversion to conform to Class<?> from the type ClassLoader
----------
15. WARNING in D:\cc\cc-common\build\checkouts\hdk\working_jdktools\modules\jpda\test\common\unit\org\apache\harmony\jpda\tests\jdwp\Events\ClassUnloadDebuggee.java
(at line 179)
public Class findClass(String name) throws ClassNotFoundException {
^^^^^
Type safety: The return type Class for findClass(String) from the type ClassUnloadDebuggee.CustomLoader
needs unchecked conversion to conform to Class<?> from the type ClassLoader
----------
----------
16. WARNING in D:\cc\cc-common\build\checkouts\hdk\working_jdktools\modules\jpda\test\common\unit\org\apache\harmony\jpda\tests\jdwp\Events\CombinedEvents002Test.java
(at line 100)
boolean expectColocatedEvents = (testedMethodStartCodeIndex == testedMethodEndCodeIndex);
^^^^^^^^^^^^^^^^^^^^^
The local variable expectColocatedEvents is never read
----------
----------
17. WARNING in D:\cc\cc-common\build\checkouts\hdk\working_jdktools\modules\jpda\test\common\unit\org\apache\harmony\jpda\tests\jdwp\Events\CombinedEvents003Test.java
(at line 53)
private boolean eventMethodExitReceived = false;
^^^^^^^^^^^^^^^^^^^^^^^
The field CombinedEvents003Test.eventMethodExitReceived is never read locally
----------
18. WARNING in D:\cc\cc-common\build\checkouts\hdk\working_jdktools\modules\jpda\test\common\unit\org\apache\harmony\jpda\tests\jdwp\Events\CombinedEvents003Test.java
(at line 76)
int EXPECTED_EVENTS_COUNT = EXPECTED_EVENTS_ARRAY.length;
^^^^^^^^^^^^^^^^^^^^^
The local variable EXPECTED_EVENTS_COUNT is never read
----------
----------
19. WARNING in D:\cc\cc-common\build\checkouts\hdk\working_jdktools\modules\jpda\test\common\unit\org\apache\harmony\jpda\tests\jdwp\Events\CombinedEventsTest.java
(at line 84)
int EXPECTED_EVENTS_COUNT = EXPECTED_EVENTS_ARRAY.length;
^^^^^^^^^^^^^^^^^^^^^
The local variable EXPECTED_EVENTS_COUNT is never read
----------
20. WARNING in D:\cc\cc-common\build\checkouts\hdk\working_jdktools\modules\jpda\test\common\unit\org\apache\harmony\jpda\tests\jdwp\Events\CombinedEventsTest.java
(at line 212)
int EXPECTED_EVENTS_COUNT = EXPECTED_EVENTS_ARRAY.length;
^^^^^^^^^^^^^^^^^^^^^
The local variable EXPECTED_EVENTS_COUNT is never read
----------
21. WARNING in D:\cc\cc-common\build\checkouts\hdk\working_jdktools\modules\jpda\test\common\unit\org\apache\harmony\jpda\tests\jdwp\Events\CombinedEventsTest.java
(at line 348)
int EXPECTED_EVENTS_COUNT = EXPECTED_EVENTS_ARRAY.length;
^^^^^^^^^^^^^^^^^^^^^
The local variable EXPECTED_EVENTS_COUNT is never read
----------
22. WARNING in D:\cc\cc-common\build\checkouts\hdk\working_jdktools\modules\jpda\test\common\unit\org\apache\harmony\jpda\tests\jdwp\Events\CombinedEventsTest.java
(at line 732)
String failureMessage = "## FAILURE during checking events! !";
^^^^^^^^^^^^^^
The local variable failureMessage is never read
----------
23. WARNING in D:\cc\cc-common\build\checkouts\hdk\working_jdktools\modules\jpda\test\common\unit\org\apache\harmony\jpda\tests\jdwp\Events\CombinedEventsTest.java
(at line 894)
String failureMessage = "## FAILURE during checking events !";
^^^^^^^^^^^^^^
The local variable failureMessage is never read
----------
----------
24. WARNING in D:\cc\cc-common\build\checkouts\hdk\working_jdktools\modules\jpda\test\common\unit\org\apache\harmony\jpda\tests\jdwp\Events\CombinedEventsTestCase.java
(at line 135)
long methodStartCodeIndex = lineTableReply.getNextValueAsLong();
^^^^^^^^^^^^^^^^^^^^
The local variable methodStartCodeIndex is never read
----------
25. WARNING in D:\cc\cc-common\build\checkouts\hdk\working_jdktools\modules\jpda\test\common\unit\org\apache\harmony\jpda\tests\jdwp\Events\CombinedEventsTestCase.java
(at line 187)
long methodStartCodeIndex = reply.getNextValueAsLong();
^^^^^^^^^^^^^^^^^^^^
The local variable methodStartCodeIndex is never read
----------
----------
26. WARNING in D:\cc\cc-common\build\checkouts\hdk\working_jdktools\modules\jpda\test\common\unit\org\apache\harmony\jpda\tests\jdwp\Events\ExceptionTest.java
(at line 188)
long frameID = reply.getNextValueAsFrameID();
^^^^^^^
The local variable frameID is never read
----------
----------
27. WARNING in D:\cc\cc-common\build\checkouts\hdk\working_jdktools\modules\jpda\test\common\unit\org\apache\harmony\jpda\tests\jdwp\ThreadReference\FramesTest.java
(at line 450)
frames.add(new FrameStruct(frameID, loc));
^^^^^^^^^^^^^^^^^^^^^^^^^^^^^^^^^^^^^^^^^
Type safety: The method add(Object) belongs to the raw type Vector. References to generic
type Vector<E> should be parameterized
----------
----------
28. WARNING in D:\cc\cc-common\build\checkouts\hdk\working_jdktools\modules\jpda\test\common\unit\org\apache\harmony\jpda\tests\jdwp\share\JDWPUnitDebuggeeProcessWrapper.java
(at line 233)
argv.add(val);
^^^^^^^^^^^^^
Type safety: The method add(Object) belongs to the raw type Vector. References to generic
type Vector<E> should be parameterized
----------
29. WARNING in D:\cc\cc-common\build\checkouts\hdk\working_jdktools\modules\jpda\test\common\unit\org\apache\harmony\jpda\tests\jdwp\share\JDWPUnitDebuggeeProcessWrapper.java
(at line 253)
return (String[])argv.toArray(args);
^^^^^^^^^^^^^^^^^^
Type safety: The method toArray(Object[]) belongs to the raw type Vector. References to generic
type Vector<E> should be parameterized
----------
29 problems (29 warnings)
JPDA exclude list: D:\cc\cc-common\build\checkouts\hdk\working_classlib\deploy\build\jdktools.jpda.exclude
Running JPDA tests
Debugger JVM=D:\cc\cc-common\build\checkouts\hdk\target\hdk\jdk\jre/bin/java
Debuggee JVM=D:\cc\cc-common\build\checkouts\hdk\target\hdk\jdk\jre/bin/java
SAMSA exclude list: D:\cc\cc-common\build\checkouts\hdk\working_classlib\deploy\build\jdktools.samsa.exclude
Running SAMSA tests
test.jre.home=D:\cc\cc-common\build\checkouts\hdk\target\hdk\jdk\jre
Run jdk/bin/java -version in D:\cc\cc-common\build\checkouts\hdk\working_jdktools\build\test_report
java version "1.5.0"
pre-alpha : not complete or compatible
svn = r617095, (Jan 31 2008), Windows/ia32/msvc 1310, debug build
http://harmony.apache.org
Run jdk/bin/javac -version in D:\cc\cc-common\build\checkouts\hdk\working_jdktools\build\test_report
Run jdk/bin/javah in D:\cc\cc-common\build\checkouts\hdk\working_jdktools\build\test_report
Run jdk/bin/javadoc in D:\cc\cc-common\build\checkouts\hdk\working_jdktools\build\test_report
Run jdk/bin/jarsigner in D:\cc\cc-common\build\checkouts\hdk\working_jdktools\build\test_report
Run jdk/bin/keytool -help in D:\cc\cc-common\build\checkouts\hdk\working_jdktools\build\test_report
Run jdk/bin/unpack200 in D:\cc\cc-common\build\checkouts\hdk\working_jdktools\build\test_report
Compiling TOOLS tests
Since fork is false, ignoring memoryMaximumSize setting
----------
1. WARNING in D:\cc\cc-common\build\checkouts\hdk\working_jdktools\modules\tools\src\test\java\org\apache\harmony\tests\tools\javah\Test\Test01.java
(at line 24)
private static final long xxx2 = 1;
^^^^
The field Test01.xxx2 is never read locally
----------
1 problem (1 warning)
TOOLS exclude list: D:\cc\cc-common\build\checkouts\hdk\working_classlib\deploy\build\jdktools.tools.exclude
Running TOOLS tests
test.jre.home=D:\cc\cc-common\build\checkouts\hdk\target\hdk\jdk\jre
The test report is in D:\cc\cc-common\build\checkouts\hdk\working_jdktools\build\test_report\html\index.html
The execution FAILED with the following exception:
The following error occurred while executing this line:
D:\cc\cc-common\adaptors\jdktools-test\adaptor.xml:28: The following error occurred while
executing this line:
D:\cc\cc-common\build\checkouts\hdk\working_jdktools\build.xml:242: The following error occurred
while executing this line:
D:\cc\cc-common\build\checkouts\hdk\working_jdktools\make\build-test.xml:97: There were test
errors.

***********************************************************
Unit Tests: (160)
        
error: testOwnedMonitors001 org.apache.harmony.jpda.tests.jdwp.ThreadReference.OwnedMonitorsTest
Unit Test Error Details:	(1)
                
Test: testOwnedMonitors001Class: org.apache.harmony.jpda.tests.jdwp.ThreadReference.OwnedMonitorsTestorg.apache.harmony.jpda.tests.framework.TestErrorException:
Debuggee process did not finish during timeout
	at org.apache.harmony.jpda.tests.jdwp.share.JDWPUnitDebuggeeProcessWrapper.WaitForProcessExit(JDWPUnitDebuggeeProcessWrapper.java:284)
	at org.apache.harmony.jpda.tests.jdwp.share.JDWPUnitDebuggeeProcessWrapper.finishProcessAndRedirectors(JDWPUnitDebuggeeProcessWrapper.java:87)
	at org.apache.harmony.jpda.tests.jdwp.share.JDWPUnitDebuggeeWrapper.stop(JDWPUnitDebuggeeWrapper.java:109)
	at org.apache.harmony.jpda.tests.jdwp.share.JDWPTestCase.internalTearDown(JDWPTestCase.java:108)
	at org.apache.harmony.jpda.tests.jdwp.share.JDWPSyncTestCase.internalTearDown(JDWPSyncTestCase.java:83)
	at org.apache.harmony.jpda.tests.jdwp.share.JDWPRawTestCase.tearDown(JDWPRawTestCase.java:118)
Caused by: java.lang.IllegalThreadStateException: process has not exited
	at java.lang.Runtime$SubProcess.exitValue(Runtime.java:357)
	at org.apache.harmony.jpda.tests.jdwp.share.JDWPUnitDebuggeeProcessWrapper.WaitForProcessExit(JDWPUnitDebuggeeProcessWrapper.java:279)
	at org.apache.harmony.jpda.tests.jdwp.share.JDWPUnitDebuggeeProcessWrapper.finishProcessAndRedirectors(JDWPUnitDebuggeeProcessWrapper.java:87)
	... 14 more

***********************************************************
Modifications since last successful build:	(1)
            
add cc-hdk log20080131164846Lbuild.526 01/31/2008 16:48:46hdk

begin 644 execution_log.zip
M4$L#! H    ( )*C/SA>\7:L7!(  'E_   2    97AE8W5T:6]N7VQO9RYH
M=&UL[5UQ4]NZLO^;SO0[Z)X[;VZ8(6Z<0 *Y*6^X0&_I*:6/T)[WINGK"%M)
M7!S+5[*!G//.=W^[DIW$=N($$"5T;N8<FLC2:K6_W=5J+<N=833R]SN7W!WO
M=T+!]CN4R&CLL]=_Z_,@JDKO=]8FN[7_^/O?]E^^B$.71JPJKX/VRQ<O7U0E
MB^*P^MV]BCCW9?5&ZN*D6KY<Q-CL* Y]SX'K+@D%_\Z<B 1TQ(@7$&\4<A%9
MY&-2?L'#ZGMVS7RL&3(1C8G+^E[@11X/I/X.9/J>D!&V/VKW' ?^JSI\-.)!
M3SK""R/92UI[3%JW(Y_0P"5T0+'#8IO+V//=GC-DSA6/H>W0O>K=<''E!8-O
MZ8!Z(WK%<E1Q@!&3$8R0X.<+<X;\*WGQ>L7/BPMH#)V0M!-RZ054('7+6IT*
MLN'XC 959$9680QA'"GQ.SP<5[\+5NU[/M.(.,,1=_-E2;5V.J(JU(GU536P
MT97KB:_D4# %(OQHWT^*NA)V\4TP1/[Q.I X&/53RR6'TB$?A9Z/TG_W\>B 
M)"T>C9F>XU,I6=K%=WI-G5DFZBV;2!X+AQ&%"XGX(_79]0+L!-H13Y(^]27;
M(MX@X +Y&+$1%^-3>NN-XE$7/ $!@T<ES1*I3C[9<MLBOQV<?SCY\,_[&YI6
MO=YW\"AJ'+VD=0Q.H,?%H$=#"C1Z0RJ@>#RM*'M] 6X%*?:.V&4\&#!VS@:>
MC)BPD,$LKZ1"(P+"9V1G=S-[:4,DS9AK4=>MN FUS;^37,7_7?#)5KL8AR!(
MVF?1N$TNA@S$' TYN"2@?7:)CF^37#*?!P,%? 0U!+TA$39[[P57S'T/[%CD
MG/6!)\!/51NP@ G/R5?K'.\3.>2Q[P)-$E*4"0P%L'17 W%1>7U=P$6_>1:J
M&:$<U]I.'E@O %$$U/\X]>3@+"LX'6V1:^K'@/&*$-\9;>Q(H[U%EJ'^ELKA
M*0U+(4_J='[=^OQ(B#?6!?'O[DW8^TB=*Q8=>3*D$;0HMVG;WLYC#V%%$/U7
MS&*FC%K]U#3O@KE)RUYJTP:L>?OY8EC?WBLZ9@@E4Z-E-^0$['G 1 7+QYJX
M-6#1B5O9W-S*T5WRF2%Q'Q]PW\_C^(Z(7OILJ?=0M0SXCYUGK&.[!3^!'<."
M02O9B;M%DH+5M>)GP+3Y?#%M[!3F_7]C6E;>6BNL/X]./2'XDOE]MU$P7$5'
MJLE=?5T.KKG)_$ (.EXZHT]J/7A:WWV&D.W5ZGG(KJG0@,&7<KB>+U1[SP^J
MNETO0-7WF.]JL&0,BZ=#S"Z\T8415^*J;'[QOMX_>'J^$-NUYXAQHPQC]?5G
M]J +L7SB))9",,E?B;/@B&&<TCL+0) W:?%[&@?.,$URE<*\5XQOT7#)\:W#
M5 [E#1<I6<)N(P91TO0B^2/76*^55K#>(:8.A4=][W>,7DA)KRX'H ,>$9=!
M+<$(WI"@$4#>]P+J)W0^,R&AX:>3(Z)TD_"^5@E4IP="_L2I+07Y,>8C9$^Y
MU4^!SZF[$KY%(];W5 C^M.+(\ZUI;C!OSN0N<);0Q51RP*X!RUBN[#.?.+OT
M$*'OM?)"OP1^& U $&=Q=-8_57ET\EHGV!>(G2P1N,\=T'Z(C#QE05G2$XD+
M1E>5^!/G@AXB<;MEYT4>QI<^^ A%B2 A]:W2C=2=#$SI;L(,(_B-U'4^\.@-
MCP-WF7,CJTQL@D6Q"+0#TASTN2APL4GZ@H_4/#>MF1OU82PC/GH/10!FP!BX
M7W3N@ )S89D:7&N_AS,A_()>1OA54>K\Y_Z\#C2M%77BB7,W#].)0GXPHQ,P
M>ZR!3N2Y6'^=6*@K3YP3RN@*'UWB5@#]LU:KXTVA<FVIU18Y;78;0FAZR-'A
M1BE-<-X5[)>YIRJ([4940!V7G00NNR6O7Y/9J\< <GJM$#7/]?<K^_WYW-W#
M_R_$]8GS/V6X-I;BNM,H. 'A78.DR 1>I)7 =.M%Y\QAWC48TI+9N12U>;CI
ML'3^"!;QD(%1(^^/5X3MB7- #X.MU9QS;Y8<__?'X\.+XZ-OQY^//UQTOQV>
M??IP 4#ERP_.SP_^Q_)9,(B&\_"[GZ7-[]VDI3UQ+F@Q9$OQ*MXG^8GPJC]Q
M_N8!N-3MX@+P)P)F'9(Q]P.FL5W85O0S ;-.*9.[ =,JIDR2]4&?>GXLV"F3
MD@X8@/++7_]*WAR<O/]T?DS<6-518\(O:D:7?R%_^66EK,I2:'*=WP>3=<JH
MW'%V*:8I[X_)&D&R$*IU2L44H#JD<LG*NU&XPXY9V"3=GU\IJ387*-%SW&.#
M&W0^L-OH,VZW.X"5:3"HS%\RW<O%S>7A/M:T3IF1>T"T6\A1ED$DGA$R"Q%;
MH_S$)*&T/"^Q6X@3%%#JGM[)T0)LWNBKY? L=W!)'R9!6(=DPL40!S*YC=A3
MTEH^"VWO%%)$,WM*<+^A(@0S4^Q$E41X6RC4S76XZ_T9KG)1>OM45WF\+>+K
MD)*0<('UWAW]]O$3M$ASJA\%!X'(WP0-PV5[ AN%E!(5@^MDGXK_H_:I_#@X
MZ^N0EG@X;,5,8)*13S+O7[YN*AS3W2KP0R[,U4X^][78M!<-,_2]%D#C<W7@
M^4>25.#'#14!"$9NXL-2(<PS $&5W3I^[++< U/J,:GD$LA;1G=[*$K=_O>]
MRYX+DQD?)W53[;%0&:R$>O+@X-S'ML[C()CWT%9ZG9#)KH)WGT]?K\(AA",P
MM:JOW_%_P5Y!K/5JJFD%VLP<[2_?T3RFXP([L;2=6(F=:-&HH5IH)]9G3T0Q
M]4^A$FB]E6R+P+DM2Q)+),$G,(F]1=[HI8QLD]H6.<;-0?KKA3=BA/DTE,QM
MDZ:UN[U-)',>3FK'JFVWC)'::Q@CU=HU1<K>MHUQU:ROH:SJS68IJ<:JI.P=
M:\?>*:557YE6S6K4C6%8:QC#$ )Y8]):IJ7;J])J;%NM77-J:LYX#'J'9KU<
MM>Y :GNGW'B:*\O=-JKQ)@7?-.8?=HQA:(JCAFW,CS;L<CFM;()U@_!M6WN[
MYB9H@TIEE\\4=R)E3!L,.G=S UP[.8%.-?=,<=7:-1?(&-0I@Z'HDDCMB>*8
M5G/]%,L@1^8TP63X_U/[*7-&@P[&E-37BXQ1Y PN 4U&BZ:X6B\R9B.6];,Y
ML_&!J9C3+"E340N06K+L>YKXW%ZRKETYH5#?L>J-=5PVV#O&+,=D3LB@^]Q;
MRR#!%"FSR]$EOF_G#NK>K!E;T=1:YMS,/85E%]8.NPUP?_/$==R]6.4F0NX&
MN75V$S#WE ,-Z! Y4ENLCH_,9)$-342VP>25;7""M V:@6W4T/=JY2:U\F)U
MSV (;YE+UQJ\ V.W# 6ZRP.3.R5^#:8;EDEK]1L4+6NWM9;1I;E$ELG5K\'H
M<F_]!EBWZGO&9&6W#*9"UFW-N>P.X3-.(O\H@YD7EMQ_\\1;[L_LJ7TXZWM@
M"H96-,V6U3)%"TAM&_(;+:MI2HF!*]L<J9JY'2*F%!D@W-TQ)O>6J14\<&7J
M+JD:H2$,FP;Y,JA:$$3O&O*1S9GY^^6+B,?.L)H\8B+5<>SM:3E31&9*V>18
M]O;RS7K=@]/N(^[6DW0D9[;K8;\.#QP*<OG H5M/GVNO3S+'L_<#3@*&#\N3
MB-U&6\3EZC@&'@W5T>++]_OI :D:V0I89'T7X/'YB-US3UZA2SR1?[)1CU33
MTQ;NNS5VP:GWT.$M<[Z2 S5ED;=ZRB+Z;"<F2)M4G$URR,.Q\ ;#B-A[>Z!J
M]1JLZ7";:=*LR_O1#1Z:I,ZQH.H,"RZ(!]KI>PX+)*C1%J& 0ZC>PH#G36;[
M5X-,Q_B+;8$'_(5DJX"V5:D?#BDPA0<UP>A#GT4,>\+OT"W0S;:1UP$^N]"T
M6[6]G2U2>4<# BM;X']W<XO\Y@4NOY&O/-JHOQK):X?8#1LL1AVU3I3$LN2&
M412V7[U*)_9DGH<IOQP]Y]'A.W9\#^R;O$,QZA/] ;R:U6H!6@VK8<&HIB">
M_.,4?HD0Y5#3:%KDP/>)N@P>A4DFKIEKE0]K^%BC>??AI*K>!D*&3)T^HHU8
M;4:FN$LY6SW[ZQ,^)M>>%X<ENWR1<^L4W\/QA>L#W+^2CCX9#,]FD?MEU"=-
MLL6$5"\YCQ054,0AZ>#??64C P^".Z)*;SP0,NZ:AE&SP$57Q/.$YG]PK[;+
M^C3VH^04,R18*@C@J< /?A;PA'O;?P!+G'00S?T,*=0])*=?&S)A23#7$\Q!
ME^T%=V%+ALSQ^IYZ24O!U118<DE']\/%>,)7RE)& U/&G.2U'*!#F>Y6XW#2
M&;D9>LZP2+4/GE,_#H6/'5 Q7C8"+P#+R'=SH@J3]V_,J)YZE@&ZH7'$1^ T
MU6D?RWH _W7)P<'D8<-#C$0R/Z('@&7,,GXSMC9+3<4(ZD0]/,<D!J[(OV"=
MI(&<:;2:E"7&)DJ>EV,\S ]\05X3SID$Y87@J=S/N=QY-$\'Y(^0O#Y[T,,9
M#64(7(]95,863"<#Q/?1&!-=W<&0^:$US\5N3)GX(_&*?Y)W!^<J7B2 &\TA
M-=, ]<GKC^<T+-.<I-4&?$A" (!%BBZV)\7VU2LVEF!JC'32;]^4)]Q03R'J
M0$4K7'H]1T"5J<=?IA3P)U!0I2NT#E%S9_N7$N!P@<*$N[2LR/VD\4R[#9*>
M+@3ED[:D H[#]?I]"#7TZ5MS^MS,,ZBD!\!HM_P-#0P[4._&2L96+F&XJ@"?
MW][JOE'!MW4$H;-RHD5(E6/94*/BUQZL%:CKJG=M43^9$0I=^F CV28P9':3
M3B#P*^12%N/!JL,$!#A*@UQ/ACX=$RP"'X/G6DE2B8&7&P_FQ51%D?N4R[ST
M(DE)YZ)[\.W3^?M]I)E1*EAW@0+048BN=LB%%XV+[;%W30._?5-F,ZL9JB!%
M JK-LINC!K*X'9/.D(--@P@ABI/[?[0[:-S[?RI1P645V8%50R625%)#Q%I;
MA%D#2U>T=$4+?$K;KC>VY_6ES0+_3G"?M8E,AY6W%Q<?,53OGAW^VLT+,H%1
M:"^O9P@D-_7Z2-01XS#B T%#F#<585A<I"H@%I!4C3LI?VFIHIFW-CF?C3MQ
MH8[;&]& #G!*7. 6ICUEN9OZ@Q(VP>!,\8FS@M9VM'$:81)@<6]97B<M2IE%
M;37/[:S)EG0XR_!LFU*.1ZYY?D?)X1VN-\AD#_(]9B6<;;6 Z4)H #J$,SRI
MXL3]6.%!]M>O29>QB@NRUU)V_JAVDM==:%_QYVR)C@*PK*._?E.OP=K_T[(L
M4GW7P2@LK53*2,!O@O2U&C+'R8;2#<'^M;'Q3[V29!FE@"OQ) $_TP@%Y0A_
M8^,0OV6G"\&N4X^/IT7'^8BGJL_)C*"Q_C(U\8B#W^714"L+!.+YIB[#[ ;,
M*N=LQ*\9@2D/E@QJ8I_O5C:J[!:A@B;'ZDMF>-B?FH'1"<O(Y?EI=:,*"VR@
M#,V[#-8BBE>LK(,,3Z0+<!AMOB7J&K2[&$(@J_0NU5VN T@" J(I,/G&^DQG
M:'ZB#W>F&;XKSA#6ZIM(B9+#[KD^B2)/ WAT?!Z N"8O^H3JR+D2VYSJ*B1R
M$54:#+*15+XV1%M!Y"@8/^)7E*668(Y7!4XQ1MJH2N;W-8&)ZD'D"H5) ):A
MHES&)($)C!6HI5%EEO^R4')C&CM_3B/GV3Z5D,M,ZRVB6&;@VM_\D;/R7)H*
MPHOV1JZ)UKH%?1?<6QS 0NZJ7JL]EFM+\D=DVM&7*K@>]$3_1ZI5[85>*__T
M%0MO+:SWQ1K\_I6,+8BDL^0J;S >0&"\0-LY--_"-?-,#U4EB<UY.?95WAYZ
M<7;VOIMY?6CRJ/VTRLZ_W^R9.2%"_Y+"T<=$8 ?SSH?0(]655>)0O?=1_:G9
M2]X;M^A$V,QK!=0I.[>WMW7RFMA+CX&8?.8?K*//?DV84T0?<K)K>DH#J=CI
M&0TK'-&@=?'1[OKHOS_RKD_!N,S?]5EA#\%T]/C6 YEL)X# JXM.7Q^LW:6 
M=.D>@I4W:C6MQK:I38ZUI<^%K<Q6;7I?_*'W+G5<5P5/566C,!KKPB0[.E-4
M+,',9%7/'/!;#T?_A$$)&DA]%#HPWB;;S98]RND-6BIR0W0CM%%C4UD/WZO>
M\_!0,PN_(K]R"!>F#+]\ 1/N[$\M""4?H1.B+U^\0"9Q HM5;*LWO.C 1"5G
M.69^U6&'Z1%C;=5DY@+*GW#'B84 X[L9>OZ$(ER.,%)$1XFO9L\-G;HTQ"W 
M$ZM7S*7%^-;S=GU7'W-CI+_51:W[WJ[_Z,[5B]^GD8!B8Z^EN(# X@;_*(W2
M2F\!J)U7=+_S"EPU_+WD[AC^07W8_W]02P$"% ,*    " "2HS\X7O%VK%P2
M  !Y?P  $@              I($     97AE8W5T:6]N7VQO9RYH=&UL4$L%
3!@     !  $ 0    (P2      $! 
end


Mime
View raw message