harmony-alerts mailing list archives

Site index · List index
Message view « Date » · « Thread »
Top « Date » · « Thread »
From nom...@intel.com
Subject [build-test alert] FAILED Windows 2003 x86: ega (Eclipse x 48h)
Date Wed, 30 Jan 2008 16:03:40 GMT
svn.revision=616407
BUILD FAILED:
	Ant Error Message:
C:\cc\cc-EGAx48\scripts\cc-exec-adaptor.xml:104: The following error occurred while executing
this line: C:\cc\cc-EGAx48\adaptors\ega\adaptor.xml:58: EGA scenario failed.

Date of build:	2008-01-30 13:39:17 +0600
Time to build:	504 minutes 17 seconds
Last changed:	01/30/2008 13:10:04
Last log entry:	snapshot

***********************************************************
Errors/Warnings:	(198)
            
[exec] Result: 1
[echo]
[echo]
[echo] ========================== EGA.log =======================
[echo]
[echo] --- Automated Eclipse EGA scenario for Eclipse 3.2.1 ---
[echo]
[echo] Eclipse Home = C:\cc\cc-EGAx48/build/libs/eclipse-3.2.1-win-x86/eclipse
[echo] Tested JRE Home = C:\cc\cc-EGAx48/build/checkouts/snapshot/hdk/jdk
[echo] Tested JRE options for Eclipse launching = -showversion -Xmx600M -Xms512M
[echo] Time frame for the scenario run = 48 hours
[echo] Delay factor = 2
[echo] Kill Eclipse if EGA scenario fails = 1
[echo]
[echo] Start:
[echo] 	Run Eclipse
[echo] 	wait Eclipse 'Workspace Launcher' window to appear
[echo] 	window appeared
[echo] 	Select C:\cc\cc-EGAx48\tests\ega\workspace as workspace
[echo] 	Press OK button
[echo] 	Closing window 'Workspace Launcher'
[echo] 	wait 'Java - Eclipse SDK' window to appear
[echo] 	window appeared
[echo]
[echo] Prepare Eclipse environment:
[echo] 	Close Welcome page
[echo] 	Uncheck Project->Build Automatically
[echo] 	Select Window->Preferences
[echo] 	wait 'Preferences' window to appear
[echo] 	window appeared
[echo] 	Select Java->Build Path->Classpath Variables
[echo] 	Create M2_REPO variable
[echo] 	wait 'New Variable Entry' window to appear
[echo] 	window appeared
[echo] 	Set M2_REPO value to C:\cc\cc-EGAx48\tests\ega\project\.m2\repository
[echo] 	Press OK button
[echo] 	Closing window 'New Variable Entry'
[echo] 	Press OK button to apply new preferences
[echo] 	Closing window 'Preferences'
[echo]
[echo] Import Geronimo modules into workspace:
[echo] 	Select File->Import...
[echo] 	wait 'Import' window to appear
[echo] 	window appeared
[echo] 	Select import existing project
[echo] 	Type path to search projects: C:\cc\cc-EGAx48\tests\ega\project\geronimo-1.2-beta\modules
[echo] 	Uncheck all builders
[echo] 	Import
[echo] 	Closing window 'Import'
[echo]
[echo] Import testsupport module into workspace:
[echo] 	Select File->Import...
[echo] 	wait 'Import' window to appear
[echo] 	window appeared
[echo] 	Select import existing project
[echo] 	Type path to search projects: C:\cc\cc-EGAx48\tests\ega\project\geronimo-1.2-beta\testsupport
[echo] 	Import
[echo] 	Closing window 'Import'
[echo] 	Check import result
[echo]
[echo] Start repeatable part:
[echo]
[echo] ...
[echo]
[echo] Time passed: 8.08587815192596 hours
[echo]
[echo] -------------------- Iteration 48 start ------------------
[echo]
[echo] Clean all Geronimo modules:
[echo] 	Select Project->Clean...
[echo] 	wait 'Clean' window to appear
[echo] 	window appeared
[echo] 	Clean
[echo] 	Window 'Cleaning selected projects' appeared
[echo] 	Closing window 'Cleaning selected projects'
[echo] 	Check clean result
[echo]
[echo] Build all Geronimo modules:
[echo] 	Select Project->Build All
[echo] 	wait 'Building Workspace' window to appear
[echo] 	window appeared
[echo] 	Closing window 'Building Workspace'
[echo] 	Check build result
[echo]
[echo] Open Navigator view:
[echo]
[echo] Run JUnit tests from geronimo-common module:
[echo] 	Select geronimo-common module
[echo] 	Select Run->Run...
[echo] 	wait 'Run' window to appear
[echo] 	window appeared
[echo] 	Create new JUnit run configuration
[echo] 	Run
[echo] 	Closing window 'Run'
[echo] 	Check run result
[echo]
[echo] Modify GBeanData class from geronimo-kernel module:
[echo] 	Select geronimo-kernel module
[echo] 	Select Navigate->Go Into
[echo] 	Open GBeanData.java
[echo] 	wait 'Java - GBeanData.java - Eclipse SDK' window to appear
[echo] 	window appeared
[echo] 	Select Edit->Find/Replace...
[echo] 	wait 'Find/Replace' window to appear
[echo] 	window appeared
[echo] 	Find getAbstractName() method
[echo] 	Closing window 'Find/Replace'
[echo] 	Add System.out.println("Method getAbstractName() was called!");
[echo] 	Save GBeanData.java
[echo]
[echo] Create JUnit test:
[echo] 	Open geronimo-kernel/src/test/java/org/apache/geronimo/gbean folder
[echo] 	Select File->New->JUnit Test Case
[echo] 	wait 'New JUnit Test Case' window to appear
[echo] 	Enter SimpleGBeanDataTest as test name
[echo] 	Enter org.apache.geronimo.gbean.GBeanData as class under test
[echo] 	Press Next button
[echo] 	Enter getAbstractName() as method under test
[echo] 	Press Finish button
[echo] 	Closing window 'New JUnit Test Case'
[echo] 	Find string fail("Not yet implemented");,
[echo] 	Delete string fail("Not yet implemented");,
[echo] 	Add string System.out.println(new GBeanData().getAbstractName());,
[echo] 	Save SimpleGBeanDataTest.java
[echo] 	Close SimpleGBeanDataTest.java
[echo] 	Closing window 'Java - SimpleGBeanDataTest.java - Eclipse SDK'
[echo]
[echo] Build geronimo-kernel module:
[echo] 	Select Project->Build Project
[echo] 	Check build result
[echo]
[echo] Run SimpleGBeanDataTest:
[echo] 	Select Run->Run As->JUnit Test
[echo] 	Check GBeanTest run result
[echo]
[echo] Set breakpoint in GBeanData.java:
[echo] 	Go to line System.out.println("Method getAbstractName() was called!");
[echo] 	wait for window 'Go to Line' to appear,
[echo] 	window appeared
[echo] 	Closing window 'Go to Line'
[echo] 	Set breakpoint at line 75 System.out.println("Method getAbstractName() was called!");
[echo]
[echo] Debug:
[echo] 	Select Run->Debug...
[echo] 	wait 'Debug' window to appear
[echo] 	window appeared
[echo] 	Select GBeanTest run configuration
[echo] 	Press Debug button
[echo] 	wait 'Confirm Perspective Switch' window to appear
[echo] 	WARNING! Window 'Confirm Perspective Switch' didn't appear during 60c. Add extra delay
for 120c.
[echo] 	ERROR! Window 'Confirm Perspective Switch' didn't appear during additional 120c. STOP.
[echo]
[echo] An ERROR has ocurred!
[echo]
[echo] Print error screen:
[echo] 	Open mspaint to save errror screen
[echo] 	Wait for 'error - Paint' window
[echo] 	Save error screen
[echo] 	Exit mspaint
[echo] 	Switch to Eclipse
[echo]
[echo] Exit Eclipse:
[echo] 	Menu "Java - GBeanData.java - Eclipse SDK->File->Exit" wasn't found
[echo] 	Can't exit Eclipse! Trying to kill ...
[echo] 	Eclipse window was found and killed
[echo] 	Eclipse was found and closed.
[echo]
[echo] EGA FAILED!
[echo]
[echo] ======================= eclipse.log =======================
[echo] Apache Harmony Launcher : (c) Copyright 1991, 2007 The Apache Software Foundation or
its licensors, as applicable.
[echo] java version "1.5.0"
[echo] pre-alpha : not complete or compatible
[echo] svn = r616407, (Jan 30 2008), Windows/ia32/msvc 1310, release build
[echo] http://harmony.apache.org
[echo]
[echo] Install location:
[echo]     file:/C:/cc/cc-EGAx48/build/libs/eclipse-3.2.1-win-x86/eclipse/
[echo] Configuration file:
[echo]     file:/C:/cc/cc-EGAx48/build/libs/eclipse-3.2.1-win-x86/eclipse/configuration/config.ini
loaded
[echo] Configuration location:
[echo]     file:/C:/cc/cc-EGAx48/build/libs/eclipse-3.2.1-win-x86/eclipse/configuration/
[echo] Framework located:
[echo]     file:/C:/cc/cc-EGAx48/build/libs/eclipse-3.2.1-win-x86/eclipse/plugins/org.eclipse.osgi_3.2.1.R32x_v20060919.jar
[echo] Framework classpath:
[echo]     file:/C:/cc/cc-EGAx48/build/libs/eclipse-3.2.1-win-x86/eclipse/plugins/org.eclipse.osgi_3.2.1.R32x_v20060919.jar
[echo] Debug options:
[echo]     file:/C:/cc/cc-EGAx48/tests/ega/.options not found
[echo] Time to load bundles: 109
[echo] Starting application: 10656
[echo] Application Started: 19203
[echo]
[echo] ===========================================================
BUILD FAILED
C:\cc\cc-EGAx48\tests\ega\build.xml:464: EGA FAILED!
Total time: 504 minutes 16 seconds
The execution FAILED with the following exception:
The following error occurred while executing this line:
C:\cc\cc-EGAx48\adaptors\ega\adaptor.xml:58: EGA scenario failed.

***********************************************************
Unit Tests: (0)
        
No Tests Run: This project doesn't have any tests

***********************************************************
Modifications since last successful build:	(1)
            
add cc-snapshot log20080130131004Lbuild.43 01/30/2008 13:10:04snapshot

begin 644 execution_log.zip
M4$L#! H    ( '.P/CA0T@^/V H  )$X   2    97AE8W5T:6]N7VQO9RYH
M=&UL[1MK3]O(]G.1^A^F2%>A$K&3\"AD*1(%VJ4M% '=KE2J:K GR13;8WG&
M>>ROWW-F[!"'9.R$IKU7NM$N3>(Y[_?,Y*"GPN#PX$[XH\.#.&&'!Y1(-0K8
MZUI'1*HN^3^L3?8:__FC=OA\+8U]JEA=]J/V\[7G:TF*_Q)\??U!^_0;>9/R
MP._P &#N\*TS#(/BBN*GQQC,>^;UQ#=2QQ>Y2B-R^NZ(2(]%-.&"B(BH'B,=
M$01BP*,N\434X=TTH8K#,PTU'^D-DXKYY/W5*7E-CMNWG@?_U8' <'O/U4R[
M7H]Y]R)5TI41C65/*+?GW[L__/OY:$^]@,>2D3]%R.8B#OB==)E96=]R6DZS
M#@+4AWN[^;<V94V2N\Z5P17+Y([2\(XE0+M1 0P43Q37K&[OS5]_P@(Z(AWJ
M*8&86_-7?N!!,%8"[SQ8JT-Y( &V656T"0.)&"638.IDC#N@:>3UT.RO21UL
M,^BS1&J[_QT.=QN-<WPC=YJM\\5)@)?Y["[M0@BP&/"7N.:2+YLBM.LY-%6"
MJW;Y0GQ?85GF7-57.IE2*T#T0R?3H7VQ"&/("XX"U3M>0.7T\DR[0^9](T<Q
M!>3D3YJ$(AJ1C]KDX-MMLN&]),<B'B6\VU.DN;_?W"2M1N,5N8'U&=BUZ*@!
M31AY*]+(-\$!UN5*DH"#6TJ1R$U"):%Q#%_0.V!K/B_X#<E];+WI[#B-]=F.
MH9=##JW3(.Y18#822LL=,,60 WP/[ "]^?"06\'QDMWF[G;CU2;9>$\CLM5 
M&?=>;I(O//+%0+J<;K7<4/8]TMQJ-C9)P@)&(3ATFIF/O*=4W';=GM&K0[6^
M')%T*YE9A\9/-;8.I6-@/<)XSB.\F,X=Y[%QOOH,=:KS$U,(Z_.$89(:36?>
M6ZV26\R\MS,S;_[M;8'L+2AE' Q"=OGOYL$3"7,@:V/2_MV\F#;@=W#A2*80
MLRPGWOY9-,TGAT?<YO)&)Q/FTD" >8;G?TVC?W@,/<,PII%OX94F7F_,Z_7)
MAP=^MUH.H" \4F)A.1<7(XB&E@"^8J'H3P;P0"3W$G(+>W+P8@(!*;KT=HS3
MDD@21C6^A,DT@&S_@'<6'^1K> \K,CAH!^##/$-D&#4GF(H;S:W&=_BS;VFU
M%$U4H7&=O_929^]-(AF;TSEF#+C @%M@P(5E3B"ZNH'QF<)NR]*E7EU]NGJ1
ME1%2.T;S)B&YA/(6@ZIX'ZKG@"NO5P-M^%%-88UD%#"G"6J6^C['H* !:;8:
MGD.N;SY=6HKGE6:[;6_^8D"M'.P3G9!)2;O3C<JD!/.?6!Z]GOLBN?KF/5^&
M$YQ:CJ"%"[5;Y5%1F&$F.UH=G!IH&6(K&3PF"4PTRU8:RTQ-OZ+7QRFGDU#\
M"ZAQ<I234Q .0*0GTD1:E+S\'%2T^NQ9J)JA=4*Q1,8S/2B76?/9@'(U9K#V
M99RJ\R:[1@8F.T!ER8+?ALVL-0O!DI:EUY#N/54EQ6-O7B'?/[N$K"C)IP_0
M]BHE(LO*XT!(=*.,W5EBEZFL]AX'@?I8=5".5Z4J2Z%(6(R33<X$B_H\$5'(
M(JMGH/B,?&&!AP$<0X:U,?HYTJ$,Q,0/L%C]4._JY!D-!J8@&)7;V=28^B&P
MW&$)BSQFJ4N9BB?6KMH-T9JY9)=4]>J'QSBGP'S6(W]!L.)4:&/8- WDO/7]
MZO3R$^EG(*4B7K#!&#\YC50R6J&D:H*_(&5D1K/X$'ZQ,?>M$[:@WXDA8+!U
M6DGXS5!"=3J9GH(1B0!-7,F]IAF8=+1EXO LC 5T=^\8!!\/!0F%GX*_F'Y\
MG+K:%?SP+<S)]4.#;V:7.N4_9N6JHX,;^=B02]U19[YA ;P9Q9A9('J )<EP
M<LFAY..N^K'7=3-5UIM.JWX'?>QMIM,*B0H2DMGY@.[ LMRH;@$OR73]! ?1
M<J:Q?F_D^;^+_$07F5#O+[7[LV/M=YD*S&RV=$L'\*!TI7-AC"W>4IV!U3%*
MNN,8"A_SVV3/:>SM[+W::^XT]UL[^[NE;?%B^^/D;'Q6 2VWU+*7[8Y7HZ:W
M$'4:F,[(5>)KW.=H-%4B3"]<68!I[);GX^D]WSB56@Y FD=3K2*=HMM;\)6&
M@J<M8")A*8<QG=B339BUJD%0:D.]$J4=SP(K-&A1T3-(ERI8U[<GI)I/,8O(
M!>WS+L49ML_98+E$@U/F^\\1SXH;C-8B)./4# -&"/%M3%?%<K,AR^& C?HA
M_*D2KK!L=;8U<P"VHD8KN*=0/,&PC^P+^ W*4>HH2']Y-SD7/N^,R+LW$,XG
M4)2(/KV9,O(]2R(6+&/D F0Y7.:OT/V\$^0,&B<+B';P,=_Z9+3J2%^$^C4S
M?B[BJ<\A;;T%./>*Q0'D@BH>/;E^91PB$3"=.KJ3*J&>NJ AVWA)0J9Z8J%\
M5^#6 G?D^^1Z)!4+'9$J1^\+!]'&^KFA^)B5 94$MR.8_V+]Y1]6;=,^F[;S
M4IV&"?>'!&AU?^V34\[ORL1S$=)% %<D7=><P[KY0K=[A\6T(W"@J3H>P$A=
M/S1LX:8J.:;ENX!Z#I^"6<R;8'9G";GF>,8]UJ[&!99!(4F$&Z^E&/!T,3N-
MSK7@:"TX#YD(;:V341J!7@SVTEV#"S94^;Y!*1>/'0QH9NZ^"%'P=RY[%<C.
MVA>9MD=9@ *_B *WEC?6+X0B(Z:'LX#AKB#S(3 V;3SH4SCV9#08NQF.&2&,
MY7%LR8V7SB--EV#7X3O#S<H".=OY7!9RTC99K9B+JE@UEF^!EZ^R4TUP]M$J
MXT]I+;$CG*&6*BSG71PYDI/9JY1E34C'R-/:'=PBO8.4?A\+<%3"ISL(JPS0
MDT"2#'C$GE*URI(T'EKE/F@H?@2*M8?\; V<J7*_@+]/T"K98YY0(%5&'Z]V
M5J.2^4].\')299?3JZLT6GKAJGO HC=7'AY,L=$<EF_!9QL7E@/_163\<G1U
M<7;Q[@DW"7;Q]@ 6#2C0"26^.6 %7]?W"FRE^M==82AQN:/(W*<@/?!>X:4)
M6/O%,H@N,3X(2Q(07WH)8[9+T::I#&5,$0AW4K$V O #M,UP>4JI&7)U<HEX
M<NN7E6!6C<KI$*AD+-I0:CNA#*7'UO.?:%H9O#7^SUF4DO4*(Q^.8]A2(^9U
M3$WH1!V\2VI+GQ17L0EF7I";9(0>!_+=XZT >[X97YXRCHT94=,D%/Y'>&OV
M'D,7P#SL?OREG!OO+;P].OMX>F)QZ27NW)#\:MEREV[^2VX&:UZTYU2Z&:R7
M/^%FL(9?U<U@C;SBS>!JOG,6284[N8'PM(XMV0Q?^O<B[G';]3QW\8M+KF58
M+U1236:EG!0JM_MP;Q0407U;^!89_35J*S([G]1;O#J%YY6&+^:OEJTX2+L\
MDN[T_>OO>KESM=4:?N^#S^\V]IO[D+PM&R0/G'OYU8[_&=Y-5S?[KGTUKO7N
MO+XOFE_9UUFGI([I\T"<:L!C(6=$OCZ :3;*+KKJSLHD3>VZ +*[LVO+X^.U
M!@&>/S;W6XTMBZP+%YLJKR+2XJ<WG\\^GF1EL/AD_FGU^'=O[>W=[?;\.EK\
M=",@8^I?9+7)3F.;A#Q* 2=I[A+)(%3]J8L-NHV9N%V[AE4.[]RF6J6&(O02
M>-A>^*T<&WI,NT-;@TP\T*V=\$P?2P8]\*H<(S8Q/2[U; ?.."T\]6FLH'1J
M^;,/6@,[>^W'%R"A(5E[OG;@TL,#5__BT#6_/G3U3Q'_!5!+ 0(4 PH    (
M '.P/CA0T@^/V H  )$X   2              "D@0    !E>&5C=71I;VY?
>;&]G+FAT;6Q02P4&      $  0!     " L      
end


Mime
View raw message