harmony-alerts mailing list archives

Site index · List index
Message view « Date » · « Thread »
Top « Date » · « Thread »
From nom...@intel.com
Subject [build-test alert] FAILED Windows 2003 x86_64: hdk_by_hdk
Date Thu, 24 Jan 2008 03:34:43 GMT
svn.revision=614305
BUILD FAILED:
	Ant Error Message:
C:\cc\cc-suites\scripts\cc-exec-adaptor.xml:104: The following error occurred while executing
this line: C:\cc\cc-suites\adaptors\hdk_by_hdk\adaptor.xml:52: The following error occurred
while executing this line: C:\cc\cc-suites\scripts\framework.xml:1079: Java returned: 1

Date of build:	2008-01-24 06:33:03 +0300
Time to build:	1 minute 35 seconds
Last changed:	01/23/2008 11:58:27
Last log entry:	snapshot

***********************************************************
Errors/Warnings:	(12)
            
Checkout HDK trunk -r614305 into C:\cc\cc-suites/build/checkouts/hdk
BUILD FAILED
C:\cc\cc-suites\build\checkouts\hdk\build.xml:334: The following error occurred while executing
this line:
C:\cc\cc-suites\build\checkouts\hdk\build.xml:344: The following error occurred while executing
this line:
C:\cc\cc-suites\build\checkouts\hdk\working_classlib\build.xml:282: The following error occurred
while executing this line:
C:\cc\cc-suites\build\checkouts\hdk\working_classlib\make\depends.xml:403: The following error
occurred while executing this line:
C:\cc\cc-suites\build\checkouts\hdk\working_classlib\make\depends.xml:478: ...
File depends/jars/bcprov-jdk15-138/bcprov.noidea.jar has incorrect md5 checksum.
Expected: 7e2cf5f39012b303b4246e33a66bf078 (or )
Found:    96102c4c271a5fbbf041169794ac66e7
Total time: 43 seconds
The execution FAILED with the following exception:
The following error occurred while executing this line:
C:\cc\cc-suites\adaptors\hdk_by_hdk\adaptor.xml:52: The following error occurred while executing
this line:
C:\cc\cc-suites\scripts\framework.xml:1079: Java returned: 1

***********************************************************
Unit Tests: (0)
        
No Tests Run: This project doesn't have any tests

***********************************************************
Modifications since last successful build:	(1)
            
add cc-snapshot log20080123115827Lbuild.74 01/23/2008 11:58:27snapshot

begin 644 execution_log.zip
M4$L#! H    ( %0T.#B8=&$2K@0  'H5   2    97AE8W5T:6]N7VQO9RYH
M=&ULW5A;;]LV%'XWD/_ ER'9@VZ6?-/2 %G3H-W2/2Q9]U ' DU1$6-*%$C*
ME_[Z'5*.$SN)HZQ=MUFP(?'V\=QY#H]S7?"3XXE(ER?'E:0GQQ@IO>3TS6$F
M2NTH]H7&:.C_\-/AR4&GKE*LJ:-F97S0.>@X-U0[DLZ88J+ID;5Y(_-\IB07
MU^AM3LE4U!J]/_L5:1B?(D?V@RCT>XB56J"W\9@0^#FJ9IHJ;U(SGGIDM4QY
M>3I=(RXHN4:;K7.J2<[*&T07FLH2<P0H10-].!=R"F,)X5@ISB;C0J0UIVI,
M1$EJ*6FIQTKC,L4R/=S$M733%!G2U]!8HSMV$? P&$;N+MH>8CQ<![ROU]WB
M&;Y&/QNF,\9!UI9_=U'PS1F;+=" 4TE1Q;LFL9+IG1-4+N:)@5%;TQXJ\/F1
M)Y[3"H/FT'LL"U$N03DIE6 Q:<-@.Z@WK9]V>" K(_W[CABME-!NO:@,#\;$
MU%(9VX+U<U:F8J[: 6 )%JHIT;6D=P0LAOVD'SG]J"5$J9%0J,0%]0R<@?BS
MH0%=4CFC$G5]/_0:V':8N5"6JU]@UAU9@=MS?72T4N.ER/0< ]'GH@8?T6"^
M/[;#MD:,P-OHO<PEY10KVE+HM:[ :[@@=EL+T")2>!I+"$JNHCQSS+ANM]W9
M[Q>?/J*[,-'0Z[I>\]N.(NT@+S_]AJ00>MT!D+G6X&N>!R;I8BMC5\@;3])*
M* ^K[&7DG>Y,=;T=$<Q7"H+7]!J=F;?1>,HD6*.0RVV1CJU(QVN1CD&DXQ8B
M_5Q, 1,"GJ36VZ$1?POL+?[F#&)] L)+9L73$<N&W=.7HNVSL'<:_D? ;].I
M%H(_$VN_EG)10,255(E:$OH-]ZA$57-0:M(@[SQ/<*U%DID#>2W)!/[;U&RV
M7IY_)9?&:N% %Q#H)(.@(B"ZI#0S)YSA0V1(8S5%))^JNGAQ-R>E%2W3W70Y
M$%Q++G"ZXVRT![SUJ ;0N\52>4LQ%<G'K@,1>> 'H6\[7!C:N1VX#N?+YW9]
M-+D 63@F8W 8N,[+5()<$$B/90S\\P@2,;HCE+^"+X<(2?>6.5DPAQ45WVL&
M547)'C X(90[/;>[_M@#GA:8X]*Y3;KNP/6;UCYP1<T9!4R-W&#5<+^PZG_.
MU6T-IU$2ND,P0?N]!YJ:$"@/9PZD+D'/"<+AJL,M!9S"^#LSN%4R__'AX@R=
MGWZX>'>V.=(F\5Q7V7$81C&Z@FHG$YR+N;U*D%)()(B](DC1/ >2D,F>:IL^
MZYPIQ%FYG0R]<M_H>^[[Z";DGI#NL/MO$E+@*1VOC,[2$_GA?XN>P3"&8G!G
MEGQN"'JEYZ <*\1*R)],-8:*M(?(RFW=QW[Z;@&G--16,1K0+LEZ63CR@^XD
M],-)U(WZ- QQOS_)_,$0'8&LGO!T6\3'YFO4#_PNB4AW$.!>-H%541#T1X-1
MA$F_3P>[.+T2&G.D64%C%(50<Q(!/!]T.D9C*Y5 1M[X)8(")0?U;.AR06AE
MYL2=OZWD;<7B%%=0SUJ-)I-E8A2[ZK,J['V-A6]OIHAD%5A/)G%!C?G8+0)_
M,(J;NQ0)=;@LC:J"SD'GV,,GQYZ]6O6::U;/WKG^!5!+ 0(4 PH    ( %0T
M.#B8=&$2K@0  'H5   2              "D@0    !E>&5C=71I;VY?;&]G
;+FAT;6Q02P4&      $  0!     W@0      
end


Mime
View raw message