harmony-alerts mailing list archives

Site index · List index
Message view « Date » · « Thread »
Top « Date » · « Thread »
From nom...@intel.com
Subject [build-test alert] FAILED Linux x86: jdktools-test
Date Wed, 23 Jan 2008 14:27:46 GMT
svn.revision=614305
BUILD FAILED:
	Ant Error Message:
/export/users.2/cc/cc-suites/scripts/cc-exec-adaptor.xml:104: The following error occurred
while executing this line: /export/users.2/cc/cc-suites/adaptors/jdktools-test/adaptor.xml:68:
The following error occurred while executing this line: /export/users.2/cc/cc-suites/scripts/framework.xml:1079:
Java returned: 1

Date of build:	2008-01-23 20:26:23 +0600
Time to build:	1 minute 16 seconds
Last changed:	01/23/2008 14:36:24
Last log entry:	snapshot

***********************************************************
Errors/Warnings:	(11)
            
BUILD FAILED
/export/users.2/cc/cc-suites/build/checkouts/hdk/build.xml:334: The following error occurred
while executing this line:
/export/users.2/cc/cc-suites/build/checkouts/hdk/build.xml:344: The following error occurred
while executing this line:
/export/users.2/cc/cc-suites/build/checkouts/hdk/working_classlib/build.xml:282: The following
error occurred while executing this line:
/export/users.2/cc/cc-suites/build/checkouts/hdk/working_classlib/make/depends.xml:403: The
following error occurred while executing this line:
/export/users.2/cc/cc-suites/build/checkouts/hdk/working_classlib/make/depends.xml:478: ...
File depends/jars/bcprov-jdk15-138/bcprov.noidea.jar has incorrect md5 checksum.
Expected: 7e2cf5f39012b303b4246e33a66bf078 (or )
Found:    2f3d054f5fb0f78a9be11738c6646703
Total time: 1 minute 9 seconds
The execution FAILED with the following exception:
The following error occurred while executing this line:
/export/users.2/cc/cc-suites/adaptors/jdktools-test/adaptor.xml:68: The following error occurred
while executing this line:
/export/users.2/cc/cc-suites/scripts/framework.xml:1079: Java returned: 1

***********************************************************
Unit Tests: (160)
        
All Tests Passed

***********************************************************
Modifications since last successful build:	(1)
            
add cc-snapshot log20080123143624Lbuild.87 01/23/2008 14:36:24snapshot

begin 644 execution_log.zip
M4$L#! H    ( '6C-SALQ08<0P0  #(4   2    97AE8W5T:6]N7VQO9RYH
M=&ULW5A;;]LV%'[WK^#+T.Q!=UN653= UC18AF0/:]J7(! HZBAB+(D"2?G2
M7[]#V6[KI':4+MN:"@XBD3RW[US(PVFAJ_)XFHIL=3QM)!Q/*5%Z5<*;5[FH
MM:7X)XA)Y/[R^M7QH&TRJL%2\SH>#"P%NFVLNVRFA2B5M5!F<+-D9Y28YQJ6
MP&[(B282YEQQ49/0&P;NR-[,W]$YO2&_M;S,<EZBT-2\VLNJW%FP\X&:6(T4
M3;Q_":^Y/C"M"K%(# NUNVBC,RO$/8*O)[[QG#24%4!^I[(2]8J<0082 <G6
MAO7B]*;WTXL=8F0@_S(0DPWRO<A%8PS@]2U1*Z6A,N0EK]ME+VHJ6<$U,-U*
MV I?1J$5^/W(:TV$(C6MP#&L#/F%$>[P( I[L2B$ZK3_ U=M-?#LD>TF;DB.
MWK<UN>1,BK5QBIS7S/ZU%^,N/$DE,OB"JX02J()^P+:Z:34I!4-X,1L,O:;R
M%G0O\M._+CY>$E92I4J>KL7;MK/^+82<H=')=KH7Q_<?_R12"/UY #D66F-F
M. X&D4V[T+:%O'4D-$(Y5.6/,CZ0>:9\/$BZZPPAU'!#3LU_X[B,2XP?(5?$
M@64CI'9:!5+9OL,8_BS58H IIW.'@PJR&2*KG"*;.7O@O*YFR/2&O)70I29^
MQ,_"?->^!=>L2!"Y9%Y]L[CT*HC[>&Y=^_R<M[7[7]!95%@5)2C12@;/): 1
M35NB(Y,UVP/%GK9:)#D8=;;P)?BG#I \NOI*KDR4:D'$'*3D6 X$UH4,<K/S
M& -$CGFM9H05,]56CXBR,FB@S@ZI9&5B49>"9OMWK+<F4KOD67-S[JA4SDK,
M1'+I6[[KCETO<+L!&Z<.R,(4*<O5'I'WEU8(@64V;XOG5OJH@H@&0<QXSC$)
MC[1L87_E?8)%%A,2?D*S9,4M7C7E3VJ::H"]:--2!J4UPJUC^_*BK5G2DM;6
M7>+;8]M=?[UL>\!L.6C.Q/8V'_8GWKQ8>^Y:W%Z2P(XPX+KW%^V=E&$/-C=M
MHS>RO"#:#-BUP V5_G>F[?:B'\XO3LG9R?G%N].=B2>?%3^WLG$0#&-RA1UB
M+LI2+ P0>&H0D@C&6BD1OT6!RA%S#FJ[\Z\NN#(=U[V#S3_18?A_Z7"_+_E*
M*3_R?Q2E*CH#9Q.>G6Y#-_AQ=1M',39^!\['9T:U)V8;*:@BO,:3E&F^2)6-
M"-MDNOT@M=\M<>O&1BHF8_!9/LJ#B>OY:> &Z= ?AA $- S3W!U'Y A!>U@;
MSD1;(S4^?AYD[FB(/%(W'T=TDH+GC8.(A>$P'+O!?BNOA*8ET;R"F'BDXG6K
M@4RPRV0"[1X,C/LV_L$S^3JI";8F!?IJQ[%+!HU9$P^^U^,'O4PSVF WBY[8
M7I'AJ-X.=RX-H^^/MH.R%9.\P<C*):W A%8GSG/'DWA]/R*Q)Y>U\:0WF#KT
M>.IT5X+.^GK0Z>X*_P902P$"% ,*    " !UHS<X;,4&'$,$   R%   $@  
M            I($     97AE8W5T:6]N7VQO9RYH=&UL4$L%!@     !  $ 
*0    ',$      $! 
end


Mime
View raw message