harmony-alerts mailing list archives

Site index · List index
Message view « Date » · « Thread »
Top « Date » · « Thread »
From nom...@intel.com
Subject [build-test alert] FAILED Windows 2003 x86: hdk debug
Date Wed, 23 Jan 2008 12:10:51 GMT

BUILD FAILED:
	Ant Error Message:
D:\cc\cc-common\scripts\cc-exec-adaptor.xml:104: The following error occurred while executing
this line: D:\cc\cc-common\adaptors\hdk\adaptor.xml:48: The following error occurred while
executing this line: D:\cc\cc-common\scripts\framework.xml:1070: Java returned: 1

Date of build:	2008-01-23 18:04:52 +0600
Time to build:	5 minutes 15 seconds
Last changed:	01/23/2008 17:56:49
Last log entry:	Quick fix for commit r614462. After it the build fails on Linux with error:
line 299: -Duse.libstdc++6=${use.libstdc++6}: bad substitution

***********************************************************
Errors/Warnings:	(12)
            
[cc-ant]: Test Suite 'hdk' execution. Repository updated: true
[cc-ant]: Result: failed.superiors = '${failed.superiors}'
[hdk]: Updating HDK workspace to revision: HEAD
BUILD FAILED
D:\cc\cc-common\build\checkouts\hdk\build.xml:335: The following error occurred while executing
this line:
D:\cc\cc-common\build\checkouts\hdk\build.xml:346: The following error occurred while executing
this line:
D:\cc\cc-common\build\checkouts\hdk\working_classlib\build.xml:282: The following error occurred
while executing this line:
D:\cc\cc-common\build\checkouts\hdk\working_classlib\make\depends.xml:430: The following error
occurred while executing this line:
D:\cc\cc-common\build\checkouts\hdk\working_classlib\make\depends.xml:464: The following error
occurred while executing this line:
D:\cc\cc-common\build\checkouts\hdk\working_classlib\make\depends.xml:492: Can't get http://svn.apache.org/repos/asf/harmony/standard/depends/libs/windows.x86.libstdc++6/icu-3.4.zip
to D:\cc\cc-common\build\checkouts\hdk\working_classlib\depends\libs\windows.x86.libstdc++6\icu-3.4\icu-3.4.zip
Total time: 5 minutes 7 seconds
The execution FAILED with the following exception:
The following error occurred while executing this line:
D:\cc\cc-common\adaptors\hdk\adaptor.xml:48: The following error occurred while executing
this line:
D:\cc\cc-common\scripts\framework.xml:1070: Java returned: 1

***********************************************************
Unit Tests: (0)
        
No Tests Run: This project doesn't have any tests

***********************************************************
Modifications since last successful build:	(9)
            
modified smishura  /harmony/enhanced/trunk/build.xml 01/23/2008 17:56:49 Quick fix for commit
r614462. After it the build fails on Linux with error:line 299: -Duse.libstdc++6=${use.libstdc++6}:
bad substitution
modified hindessm  /harmony/enhanced/classlib/trunk/modules/awt/src/main/native/gl/unix/LockingKeys.cpp
01/23/2008 17:44:18 Fixing svn:eol-style property after commit r614497.
modified apetrenko  /harmony/enhanced/classlib/trunk/modules/awt/src/main/native/gl/unix/makefile
01/23/2008 17:31:06 Patch for HARMONY-4636 "[classlib][awt] Toolkit.getLockingKeyState() is
not implemented on Linux"
modified apetrenko  /harmony/enhanced/classlib/trunk/modules/awt/src/main/java/unix/org/apache/harmony/awt/wtk/linux/LinuxWTK.java
01/23/2008 17:31:06 Patch for HARMONY-4636 "[classlib][awt] Toolkit.getLockingKeyState() is
not implemented on Linux"
modified apetrenko  /harmony/enhanced/classlib/trunk/modules/awt/src/main/native/gl/unix/exports.txt
01/23/2008 17:31:06 Patch for HARMONY-4636 "[classlib][awt] Toolkit.getLockingKeyState() is
not implemented on Linux"
added apetrenko  /harmony/enhanced/classlib/trunk/modules/awt/src/main/native/gl/unix/include/org_apache_harmony_awt_wtk_linux_LinuxWTK.h
01/23/2008 17:31:06 Patch for HARMONY-4636 "[classlib][awt] Toolkit.getLockingKeyState() is
not implemented on Linux"
added apetrenko  /harmony/enhanced/classlib/trunk/modules/awt/src/main/native/gl/unix/LockingKeys.cpp
01/23/2008 17:31:06 Patch for HARMONY-4636 "[classlib][awt] Toolkit.getLockingKeyState() is
not implemented on Linux"
modified hindessm  /harmony/enhanced/classlib/trunk/modules/luni/src/test/api/common/org/apache/harmony/luni/tests/java/io/FileTest.java
01/23/2008 17:20:58 Minor cleanup to improve error messages when tests fail.
modified hindessm  /harmony/enhanced/trunk/build.xml 01/23/2008 15:15:57 Possibly fix for
use.libstdc++6 build break.

begin 644 execution_log.zip
M4$L#! H    ( %B1-S@T_DXKD@4  /8A   2    97AE8W5T:6]N7VQO9RYH
M=&UL[5I;<]HX%'YG)O]!+SOM3L<RAD HFV8F6Y+M)>W#-FT?ZHQ'R(=8P98\
MDLREOWZ/;* )38B3IMN6788!RS[ZSCG?N<@6["<V2P_VARJ>'^SG&@[V&3%V
MGL*S1R,EK6?$9^B37O.W/QX=[#2*/&86/#.1_9W&3D,7[INXUR?@B3HCGY)X
M?-8G[YV<D.?DQ> UF2H]-CGC0*PB&B;"""7[Y,71X6 U>0;\C+QWQ\-"I#&=
M9>G:M5)S?!F"=(/=3A#0I> %F[ S\J>;/Q(I6OT55"5Q=82^>+E6>7^3D)#"
M;A0PB9I&#L:LB5TFY^8KU[P.D;$$R NF,R7GY!ABT"4#I8/UH)[5?M7#0ZX<
M^U].],DB"/7FJ]SYX/+"S(V%S,V?"AFKJ:D'P#1/A 5N"PU+ V:]KM=NU9PO
M+5&&2):![[#<_(^5 :35;+9]!*N'E"A3.O(*I9:6!+1#FU'0)(_?%9*\$5RK
MRD]#7DI.?Z^'7&8MR50,7TB.85B<U^2XL'EA2:HX,HU%XJ9;IL_!UIL_^/OD
MPQO"4V9,*H:5>DK]ZNU*&;V.EI?K0;[[\)9HI>SJ!$(FUF*M^#ZF%&5EJE.E
MSWT-N3(^,Z/;D3>6(]ABO:+=40PI6#@C _?MPA<+C=FD])P,^B'G^/:XRK#B
MPC(,(=K%QTBI";&QA3?Q^"D;(] 9>:ZA+%$<].\-N.;)5%B>1$A3-,FN[RUE
M?SRTM_3%&V&7L=P 7C9FS,@B!1.RJ0V-YF'&A R=;%A(,0LQ>F$5R#"I>E8I
M.;7C,!6RF(4G[O/CZ6OJYMQ'E\2$GD!XGE8*898K;0VUL^LSNZ*E+MJ)XBZS
M7\/<4)[G#X H)$^+&!PQ445,M" FPFD1$A.5Q$0K8I('8"5C8W"K7TVH%">5
M6!:,Q?B)<)&MUX2SE'5RI@J[4.$Q:CK%,[?%M.[B?6.27L1CJU1ZP^KZK150
MNJS!J$)S>$ =N<J+%#V/*N2-=Q"LL"H:@;-I69&8'\-U:ZZ.;I<_U7/7YY!Y
M-0&M!:XJ"I>7&),$[VF<'VJ$ZX,9$YZ,39'=JLV+(0<9;[;+PQ55IHK%&^Z&
MGKM.6/;@"M"_8-KX<S56T9N6AZOQ7C-H-\L3F%YZHSKLNVDZOTGK5\(9<N&Y
M*O'$R!O>;B7R0I ],1*8Q(^M+F##6GX'OW!IT+"USNE,>"++TZUVT.3 M\#!
M(8?4Z]#6ZF +?)JQE$GO(FK1/=JL1MO@%;@U"IUZ2H/%@'X6^2_NU07>6]BH
M37N8@N7Q%D1JR'.M)A[>N@0=+VCW%B>H5+@*LRUP,)OM7F#,FA@S=[@-:0C6
MSJM/KXN.-;<@2I=]*JQ(M\PQ WJ"#_,>/KMX+=K9!N]B0*'"<_NOJX&U(W0O
MZ'G!%I19#'HX]X(F;=. [E;#7R)D]][H6=\X"Q=\A.Z1+5SL@=)9KTO="1OS
M)T^ZH>"%UZ:[=V#73?:O1_,7:,OO;TRCRV8<N^?"!S-C 7T.]HS\A26.P/UR
MNW##;J&_V*/PC64R9CKV[V#*9A-.U?>/<%C+DB.ME79[Z-)QS964P,LG>"=*
MA:)N-^:MLL>JD/'1C$-NRQ]:?AQW_UO\_2U^SN0C2_#PN]O@-I%^7"5<'?WY
M_N7)@!P?OCPY&ER]4L?"U0^#_7:[TR>G"9"12E,U=4&'*@4X+[3&%C]-,.+$
M;?\5Y2\&-A&&I$*N[^;=4>]N]U_4^U5$OAC2ZK5^I"%NNWJ9'Z4]N^WFSV5/
M=_?GLN<IQNN_6?.GRK*46)%!GW1()F1AP9 ]8@#[=&QV&@T7IT4@L&57W8%,
MA4TP*%<BN&K<C7N'=IT5%K/<*EW1L1A4$>M]0P*M:S%<BQPY'VF6@2.]5!$T
M][!J7B%+1(,MM(2X3X+&3F/?9P?[?OFW#K_ZBX=?_M_C'U!+ 0(4 PH    (
M %B1-S@T_DXKD@4  /8A   2              "D@0    !E>&5C=71I;VY?
>;&]G+FAT;6Q02P4&      $  0!     P@4      
end


Mime
View raw message