harmony-alerts mailing list archives

Site index · List index
Message view « Date » · « Thread »
Top « Date » · « Thread »
From nom...@intel.com
Subject [build-test alert] FAILED Windows 2003 x86_64: hdk debug
Date Wed, 23 Jan 2008 11:10:26 GMT

BUILD FAILED:
	Ant Error Message:
C:\cc\cc-common\scripts\cc-exec-adaptor.xml:104: The following error occurred while executing
this line: C:\cc\cc-common\adaptors\hdk\adaptor.xml:48: The following error occurred while
executing this line: C:\cc\cc-common\scripts\framework.xml:1070: Java returned: 1

Date of build:	2008-01-23 17:04:42 +0600
Time to build:	5 minutes 21 seconds
Last changed:	01/23/2008 15:15:57
Last log entry:	Possibly fix for use.libstdc++6 build break.

***********************************************************
Errors/Warnings:	(9)
            
BUILD FAILED
C:\cc\cc-common\build\checkouts\hdk\build.xml:335: The following error occurred while executing
this line:
C:\cc\cc-common\build\checkouts\hdk\build.xml:346: The following error occurred while executing
this line:
C:\cc\cc-common\build\checkouts\hdk\working_classlib\build.xml:282: The following error occurred
while executing this line:
C:\cc\cc-common\build\checkouts\hdk\working_classlib\make\depends.xml:430: The following error
occurred while executing this line:
C:\cc\cc-common\build\checkouts\hdk\working_classlib\make\depends.xml:464: The following error
occurred while executing this line:
C:\cc\cc-common\build\checkouts\hdk\working_classlib\make\depends.xml:492: Can't get http://svn.apache.org/repos/asf/harmony/standard/depends/libs/windows.x86_64.libstdc++6/icu-3.4.zip
to C:\cc\cc-common\build\checkouts\hdk\working_classlib\depends\libs\windows.x86_64.libstdc++6\icu-3.4\icu-3.4.zip
Total time: 5 minutes 15 seconds
The execution FAILED with the following exception:
The following error occurred while executing this line:
C:\cc\cc-common\adaptors\hdk\adaptor.xml:48: The following error occurred while executing
this line:
C:\cc\cc-common\scripts\framework.xml:1070: Java returned: 1

***********************************************************
Unit Tests: (0)
        
No Tests Run: This project doesn't have any tests

***********************************************************
Modifications since last successful build:	(2)
            
modified hindessm  /harmony/enhanced/trunk/build.xml 01/23/2008 15:15:57 Possibly fix for
use.libstdc++6 build break.
modified egor  /harmony/enhanced/drlvm/trunk/vm/jitrino/src/optimizer/abcd/classic_abcd.cpp
01/23/2008 12:29:24 small enhancement of ABCD allowing to prove redundant checks where operands
areconverted back and forth between int and long. The comment in code tells why itshould be
safe.No effect on benchmarks. Synthetic tests show extra eliminated checks, but notmuch effect
on performance.

begin 644 execution_log.zip
M4$L#! H    ( $N)-SCT>UN&^ 0  / ?   2    97AE8W5T:6]N7VQO9RYH
M=&UL[5E;<],X%'[/3/^#7G9@A[%LYT;(ELY 2W=A@(>EL ^XXU&DDUJ);7DD
M.6GX]7MD)RU-J6L*4R"[F;2V+.G3=ZZ*CO<3FZ4'^Q,E5@?[A8:#?4:,7:7P
M],%4Y=8S\A.,R2CX[8\'!WN=LA#,@F<6^7BOL]?1I;L2]_D(Y\!/R7MW/REE
M*NAYEF[U59,%L8IH6$@C54Z&8;__)*";@3.V8*?DN9L_E2DN? VJ'G&UA72\
M0JMBW#1(YM(V#C")6L8.QFP-6\O $[4]Y?.>+WR>%8PG0/YB.E/YBAR# %UI
MH!*P'=33UI]V>*@KI_W+!V.R-D*[^:IP,LC\C)B5L9"Y^4N9"[4T[0"8YHFT
MP&VI84/@?#2,AWUOV&\)D5NB#,E9!KZ#<Q#_U!Q(-PAZ/LM$6ZQ$F4J:5SAJ
M0R>D QK$09\\?%?FY(WD6M7"&O(RY_3W=LB5ZY),";C4M(!)>=92T:4M2DM2
MQ5'=&"ENNF7Z#&R[^4=_O_[PAO"4&9/*2;T\I7[]72H]1ZGC37<[R'<?WA*M
ME+UX@)")M1@POH]^15GE[U3I,U]#H8S/S/1VY,:8!%MNA[6[$Y""A5-RY*[.
M?$)J="FE5^1P''&.7X^K#,,NJLP0(2\^1Y6:*!'SZ"8]?LSF"'1*#C54<8J-
M\9T!MR192LN3&-44+[(O)YC+!+K(HIFT6N8J,II'JK RPSRL(S;AN+0SFN2Q
M:U!>% U@;3/NC5PW#M+ ^)F]*_A,S*U2Z0WY]AO!:VMI,*K4'+[C&H4JRA35
M&M?(C7L**ZV*I^ X;309X]\VFZNMV\>?Z)5S>C2K6H#6$E.,PEPC8.IV.2>'
MFF*R,'/"D[DILUM7\P04D(MF7AXFV#Q53#3LCX<N+*J K ']&=/&7ZFYBM]T
M/4S.CX.P%U0/*'8U+H=!F*:KFU:]-CA#77CN5X,GI][D=I:H%X+:DU.)$?+0
MZA(:$OM7R(5Y0L/."J<SZ<FL2'=:0%, WP$!)QQ2;T"[%S<[(-,Y2UGNS>(N
M?4R#NK4+4H';HU"H)S1<-^@G6?SB4LU*W(WB'AVA"U;W.V"I"<<CXL+#GR[A
MP M[H_4#FBO<A=D.")B=]V=HLP!MYFYWP0W!VE7]WQNB8,$.6.ESF4HKTQT3
MS(!>X,G.8X7TNG2P"]()P$&EYXIJ%PUKIRA>./+"'0@S 7JR\L* ]FA(^W7S
MES#9G4_]VU64:*V/R!W9HG55C-;%+>J>6<$?/1I&DI=>CS84J*XIV$WV;P3T
MUX";ZS<ZT^=,CMWI\'LR6:.?@3TE?V*L(_:X*B(UU)#\I*Z@^L:R7# M_*]C
MT\SB1-V+M:-69%YHK;0KLN9.Z5SE.?#J0.^&4JGH,3K_6V6/59F+%^<<"M?[
M@S7X/^G[(GW(\@>6X.U]T'#UI1\:&%=;S]^_?'U$CI^]?/WBZ&I/&Y(7+Y+&
MO=Y@3$X2(%.5IFKIK ^U+W!>:HT;P#)!TQ-7'"RKXK)-I"&IS+=K?5^Y;G]X
MC^M>,\HED>ZH^R.)9&P.&Q>I^/1[P<_%9]C_N?@\07O]ER/_1%F6$BLS&),!
MR61>6C D'! #F+>%V>MTG+G6]L 47B<)LI0V0=M<,>1%(N_<V<+;FF&"%5;I
M6B7K1FVXT3?XT?8JAFM9H-ZGFF7@%%\M$0:/,7A>H9J(!EOJ',28A)V]SK[/
M#O;]ZH6^7[_<]ZLW_?\"4$L! A0#"@    @ 2XDW./1[6X;X!   \!\  !( 
M             *2!     &5X96-U=&EO;E]L;V<N:'1M;%!+!08      0 !
+ $     H!0     ! 
end


Mime
View raw message