harmony-alerts mailing list archives

Site index · List index
Message view « Date » · « Thread »
Top « Date » · « Thread »
From nom...@intel.com
Subject [build-test alert] FAILED Linux x86_64: jdktools-test
Date Wed, 23 Jan 2008 11:34:34 GMT
svn.revision=614305
BUILD FAILED:
	Ant Error Message:
/export/users/cc/cc-suites/scripts/cc-exec-adaptor.xml:104: The following error occurred while
executing this line: /export/users/cc/cc-suites/adaptors/jdktools-test/adaptor.xml:68: The
following error occurred while executing this line: /export/users/cc/cc-suites/scripts/framework.xml:1079:
Java returned: 1

Date of build:	2008-01-23 17:31:32 +0600
Time to build:	2 minutes 53 seconds
Last changed:	01/23/2008 15:48:06
Last log entry:	snapshot

***********************************************************
Errors/Warnings:	(11)
            
BUILD FAILED
/export/users/cc/cc-suites/build/checkouts/hdk/build.xml:334: The following error occurred
while executing this line:
/export/users/cc/cc-suites/build/checkouts/hdk/build.xml:344: The following error occurred
while executing this line:
/export/users/cc/cc-suites/build/checkouts/hdk/working_classlib/build.xml:282: The following
error occurred while executing this line:
/export/users/cc/cc-suites/build/checkouts/hdk/working_classlib/make/depends.xml:403: The
following error occurred while executing this line:
/export/users/cc/cc-suites/build/checkouts/hdk/working_classlib/make/depends.xml:478: ...
File depends/jars/bcprov-jdk15-138/bcprov.noidea.jar has incorrect md5 checksum.
Expected: 7e2cf5f39012b303b4246e33a66bf078 (or )
Found:    8cd310e184ef38b8e5c82096a1fb7661
Total time: 2 minutes 46 seconds
The execution FAILED with the following exception:
The following error occurred while executing this line:
/export/users/cc/cc-suites/adaptors/jdktools-test/adaptor.xml:68: The following error occurred
while executing this line:
/export/users/cc/cc-suites/scripts/framework.xml:1079: Java returned: 1

***********************************************************
Unit Tests: (160)
        
All Tests Passed

***********************************************************
Modifications since last successful build:	(1)
            
add cc-snapshot log20080123154806Lbuild.76 01/23/2008 15:48:06snapshot

begin 644 execution_log.zip
M4$L#! H    ( $V,-SBPBWF)0P0  "84   2    97AE8W5T:6]N7VQO9RYH
M=&ULW5A);]LX%+[[5_ R:.:@W985C1L@TS28%,D<VK27(! HZBEB+(D"27GI
MKY]'V4[KI':4(#/35)!A<7O+]Q;R<5+HJCR:I");'DT:"4<32I1>EO#V32YJ
M;2G^%6(2N;_]\>9HT#89U6"I61T/!I8"W3;6;3;50I3*FBO3N9ZRU4O,<P4+
M8-?D6!,),ZZXJ$GH#0-W9*_';^F,7I,_6UYF.2^1:6H^[455;DW8:J D5B-%
M$^^>PFNN]PRK0LP30T)M3UK+S IQ;\'W S]XCAO*"B!_45F)>DE.(0.)@&0K
MQ7I1>MO[Z44.,3*0?^N(R1KY7LM%8Q3@]0U12Z6A,LM+7K>+7JNI9 77P'0K
M8<-\$85).+3"83\*M29"D9I6X!AJAL*YX>_0*NM)HQ"JT^ #SMI(X=DCVTW<
M0W+PJ:W)!6=2K!14Y*QF]N^]"'<N2BJ1P3=L)91 %?0#M]5-JTDI&$*,$6'6
M:RIO0/=:?O+Q_,L%8255JN3IBKUM.ZMW+N04E4XVP[TH?OKR-Y%"Z+L.I%AH
MC='A..A(-NW<VQ;RQI'0".50E3]*>$_TF13R(/"N,H10PS4Y,?_&<!F7Z$-"
M+HD#BT9([;0*I'(8P]=2+;J8<CIC."@>FR*NRBFRJ;,#S*MJBB2OR3L)77!B
M(WX!TMNZS;EF18*H);/JA\FE5T+<17-CUI>GO,G=_X+,HL*L*$&)5C)X*0:-
M:-H2S9BLR.Y)]K35(LG!B+.!+\&?VK/DT=F7<FD\5 LB9B EQU0@,"=DD)N=
MQR@@<HQI-26LF*JV>H25E4$#=;9/)"L3\[H4--N]8[TSGMH%SHJ:<TO1I9=B
M*I(+W_)==^QZ@=MUV#BTAQ<&2%DN=["\/[5"""RS>5L\M])'!40T"&+&<XXA
M>*!E"[NS[A,TLIB0\ NJ)2MN\:HI?U'55 /L5:N6,BBMD>W??;QJ;1:TI+5U
MF_CVV'97K=>M#Y@M!]4YM+UUP_[*FU>KSVV+VTL2V!$Z7/?]JJV3,JS!9J9L
M]$:6%T3K#KL6N*'2_TZU[5KT\]GY"3D]/CM_?[(U\,23XETA&P?!,":76!_F
MHBS%W," 9P8AB6"LE1+1FQ<H&C&GH+8[^>J"*U-OW3O6/%^"X?\CP?UJY#N1
M_,C_.42JZ!2<M5MVD@W=X&>5;!S%6.KM.16?&L&>&&.DH(KP&L]/IMPB538B
M;!W?]H. ?K_ #1N+IYB,P6?Y* \.7<]/ S=(A_XPA""@89CF[C@B!PC9PXQP
M*MH:5^,3L2SP7/"B(>1!E$8P8I'O'H;4R]-Q&'J[M;P4FI9$\PIBXI.*URUB
M2H8A5I9,H.:#@3'?VCYX%E\%,\&2I$!;;1EVP: Q<^+!<RV^Q\HTHPW6KVB)
MS<48]NI-=V?2,'J^K^WAK)CD#?I5+FD%QK$Z9IX[/HQ7]R$2:W!9&SMZ@XE#
MCR9.=PWHK*X$G>Y^\!]02P$"% ,*    " !-C#<XL(MYB4,$   F%   $@  
M            I($     97AE8W5T:6]N7VQO9RYH=&UL4$L%!@     !  $ 
*0    ',$      $! 
end


Mime
View raw message