harmony-alerts mailing list archives

Site index · List index
Message view « Date » · « Thread »
Top « Date » · « Thread »
From nom...@intel.com
Subject [build-test alert] FAILED Linux x86_64: hdk debug
Date Tue, 22 Jan 2008 09:01:32 GMT

BUILD FAILED:
	Ant Error Message:
/export/users/cc/cc-common/scripts/cc-exec-adaptor.xml:104: The following error occurred while
executing this line: /export/users/cc/cc-common/adaptors/hdk/adaptor.xml:48: The following
error occurred while executing this line: /export/users/cc/cc-common/scripts/framework.xml:1069:
Java returned: 1

Date of build:	2008-01-22 14:59:30 +0600
Time to build:	1 minute 39 seconds
Last changed:	01/22/2008 14:31:57
Last log entry:	Updating bcprov downloads to use apache server.

***********************************************************
Errors/Warnings:	(11)
            
BUILD FAILED
/export/users/cc/cc-common/build/checkouts/hdk/build.xml:334: The following error occurred
while executing this line:
/export/users/cc/cc-common/build/checkouts/hdk/build.xml:344: The following error occurred
while executing this line:
/export/users/cc/cc-common/build/checkouts/hdk/working_classlib/build.xml:282: The following
error occurred while executing this line:
/export/users/cc/cc-common/build/checkouts/hdk/working_classlib/make/depends.xml:403: The
following error occurred while executing this line:
/export/users/cc/cc-common/build/checkouts/hdk/working_classlib/make/depends.xml:478: ...
File depends/jars/bcprov-jdk15-138/bcprov.noidea.jar has incorrect md5 checksum.
Expected: 7e2cf5f39012b303b4246e33a66bf078 (or )
Found:    193cf7f3d2f9f96d17b1076c61517d69
Total time: 1 minute 30 seconds
The execution FAILED with the following exception:
The following error occurred while executing this line:
/export/users/cc/cc-common/adaptors/hdk/adaptor.xml:48: The following error occurred while
executing this line:
/export/users/cc/cc-common/scripts/framework.xml:1069: Java returned: 1

***********************************************************
Unit Tests: (0)
        
No Tests Run: This project doesn't have any tests

***********************************************************
Modifications since last successful build:	(2)
            
modified hindessm  /harmony/enhanced/classlib/trunk/make/depends.properties 01/22/2008 14:31:57
Updating bcprov downloads to use apache server.
modified hindessm  /harmony/enhanced/classlib/trunk/make/depends.xml 01/22/2008 14:31:57 Updating
bcprov downloads to use apache server.

begin 644 execution_log.zip
M4$L#! H    ( "YX-CB$X%\:3@0  %\4   2    97AE8W5T:6]N7VQO9RYH
M=&ULW5A+;]LX$+[[5_"R:/:@EV7+MNH&R#8--HMD#]NTER 0:'(4,99$@:3\
MZ*_?H>2D=1([2EKL-A7\$$5R9KYY<4;3S!3YX70F^?IP6BDXG%*BS3J'=V]2
M61I'BR\0D['_V]LWA[VZXM2 HQ=EW.NI&G^)O2YA!>R*'!FB8"&TD"6)@D$P
M[+N;^1NZH%?DCUKD/!4YTIO96W=5Y%L+M@;(Q*F4K.+=2T0IS)YIG<EE8DGH
M[44;F5DF[VWX=N*1ZZBB+ /R)U6%+-?D!#@H5 =O@76B]*[SU8D<ZLBJ_.N#
MF&PTWVF[K"P 45X3O=8&"KL]%V6]ZK2;*I8) \S4"FZ9K\91$@V<:-"-0FF(
MU*2D!7B6FJ5P9OE[M. =:612-PC^PE6W4@3NT/43?T(./M8E.1=,R1:@)J<E
M<W_O1+AQ45)(#E]URV%67W=3;6VJVI!<,E0PQH/=;:BZ!M-I^_$_9Y_/"<NI
MUKF8M<Q=UVL_2ZGF"#FYG>Y$\>/GOXF2TMP]0(J9,1@;GH=NY-+&N5VIKCT%
ME=0>U>F3A/?$'IBZ>A!VEQQR,'!%CNV_-1L7"CU(JC7Q8%5)9;Q:@](>8_AQ
MF"PPU+S&%!Z*Q^:H5^UE?.[M4.9E,4>25^2]@B8T<1#_ -+;V);"L"Q!K26+
MXM'4TBD=[J)Y:];=E#_9^X+.P>-00<GU@TRZ?[7-B:", +U[4Y/I.3'R92!N
M^-Q(F3^>>;]//8WA%&A9*P8_BD$EJSI'Q$E+=L^I0FLCDQ2L.+>62O"K]VQY
M<O6%6MM@0&7+!2@E,.=(3#X<4GO$60 RQ?2AYX1E<UT73[!R-H;>(Y+#Y;+,
M)>6[C\;W-BB:&&VI>3<4HV<MYS(Y[SM]WQ_Y0>@W#UR<VL,+8S'/USM8WE]:
MH H<6R4X(G5F3PJ(VB"H,Y$*]-8#HVK8G=Z?@0CS@X)?$)8JA".**O]%H>D*
MV*N&-F.0.T.W?W?SJM&L:$Y+YR;INR/7;T>O&P_8(P?A3-Q@,W"_B.K5XKFI
M\7A)0G>,#M?<OVKKS!@6-@L'2X]@Z 3A>// +24>J/2_@[;=]'XZ/3LF)T>G
M9Q^.MR:>693>=<QQ& YB<H&-:"KS7"ZM&K!FD(I(QFJE4'O+#$4CM@JJFR+;
M9$+;QNY>6?-R"0;_CP3W&Y]O1.J/^S^'2/?+\GC@AS^K9*-QC%WEGJKXQ KV
MS!@C&=5$E%@_V<Z.%'Q(V":^W0<!_6&%!S;V&3$909^EPS2<^$%_%OKA;- ?
M1!"&-(IFJ3\:DP-4V<.,<"+K$G?C%4Q"EH[2D/?323J)>#":!?XH8E$P#$8\
MFNQ&>2$-S8D1!<0D((4H:P,D]+&'91*!]WK6>AOS8"G>QC+!CB1#4VW9=<6@
MLFOBWDL-OL?(E-,*.^76NIM!:\?QRQUL#S_-E*C0F5)%"[#>U# +_&@2MV];
M%/;XJK3&"WI3CQY.O>;]H=>^2_2:%XO_ E!+ 0(4 PH    ( "YX-CB$X%\:
M3@0  %\4   2              "D@0    !E>&5C=71I;VY?;&]G+FAT;6Q0
52P4&      $  0!     ?@0      
end


Mime
View raw message