harmony-alerts mailing list archives

Site index · List index
Message view « Date » · « Thread »
Top « Date » · « Thread »
From nom...@intel.com
Subject [build-test alert] FAILED Windows 2003 x86_64: classlib debug
Date Tue, 22 Jan 2008 09:00:21 GMT

BUILD FAILED:
	Ant Error Message:
C:\cc\cc-short\scripts\cc-exec-adaptor.xml:104: The following error occurred while executing
this line: C:\cc\cc-short\adaptors\classlib\adaptor.xml:49: The following error occurred while
executing this line: C:\cc\cc-short\build\checkouts\classlib\build.xml:282: The following
error occurred while executing this line: C:\cc\cc-short\build\checkouts\classlib\make\depends.xml:403:
The following error occurred while executing this line: C:\cc\cc-short\build\checkouts\classlib\make\depends.xml:478:
...  File depends/jars/bcprov-jdk15-138/bcprov.noidea.jar has incorrect md5 checksum.    
Expected: 7e2cf5f39012b303b4246e33a66bf078 (or )     Found:    20b208df59d3705ba49a1e913e36a0c7

Date of build:	2008-01-22 14:57:11 +0600
Time to build:	2 minutes 57 seconds
Last changed:	01/22/2008 14:31:57
Last log entry:	Updating bcprov downloads to use apache server.

***********************************************************
Errors/Warnings:	(21)
            
[cc-ant]: Test Suite 'classlib' execution. Repository updated: true
[cc-ant]: Result: failed.superiors = '${failed.superiors}'
[cc-ant]: Do cleanup for C:\cc\cc-short/build/checkouts/classlib
Checking depends/jars/yoko_M2-20070130/yoko.jar
Checksum verified (true)
Checking depends/jars/yoko_M2-20070130/yoko-core.jar
Checksum verified (true)
Checking depends/jars/yoko_M2-20070130/yoko-rmi-impl.jar
Checksum verified (true)
Checking depends/jars/yoko_M2-20070130/yoko-rmi-spec.jar
Checksum verified (true)
Checking depends/jars/bcel-5.2/bcel-5.2.jar
Checksum verified (true)
Checking depends/jars/xalan-j_2.7.0/xalan.jar
Checksum verified (true)
Checking depends/jars/xerces_2.9.1/xerces.zip
Checksum verified (true)
Checking depends/jars/junit_3.8.2/junit.jar
Checksum verified (true)
Checking depends/jars/bcprov-jdk15-138/bcprov.noidea.jar
The execution FAILED with the following exception:
The following error occurred while executing this line:
C:\cc\cc-short\adaptors\classlib\adaptor.xml:49: The following error occurred while executing
this line:
C:\cc\cc-short\build\checkouts\classlib\build.xml:282: The following error occurred while
executing this line:
C:\cc\cc-short\build\checkouts\classlib\make\depends.xml:403: The following error occurred
while executing this line:
C:\cc\cc-short\build\checkouts\classlib\make\depends.xml:478: ...

File depends/jars/bcprov-jdk15-138/bcprov.noidea.jar has incorrect md5 checksum.
    Expected: 7e2cf5f39012b303b4246e33a66bf078 (or )
    Found:    20b208df59d3705ba49a1e913e36a0c7

***********************************************************
Unit Tests: (0)
        
No Tests Run: This project doesn't have any tests

***********************************************************
Modifications since last successful build:	(2)
            
modified hindessm  /harmony/enhanced/classlib/trunk/make/depends.properties 01/22/2008 14:31:57
Updating bcprov downloads to use apache server.
modified hindessm  /harmony/enhanced/classlib/trunk/make/depends.xml 01/22/2008 14:31:57 Updating
bcprov downloads to use apache server.

begin 644 execution_log.zip
M4$L#! H    (  AX-CA1/T@JW@(  %4*   2    97AE8W5T:6]N7VQO9RYH
M=&ULS59+;]0P$+ZOU/\P%U0X.,]]AF4E1*F$!!('.#55Y=@3XJUC1[:SW>VO
MQTZW3UX"(98H!WOL^>;SS&AFEHUKY6I9:;Y;+3N#JR4%ZW827QW76CEBQ346
M,$^>O3Q>'8WZCE.'Q&Y4<32"\)TA:_0YG#%&J'+G!9QH8!*IZCNHM8$W1<F8
M_XEMM'%QU0O)8]8@N]2]LS&3U%HIJCNT+;)S^!S6+;W$DF.'BMMHV\I?7>F,
M[M X@?;QS<>[4W2L$>H+X-:A452"<-B"4$[#<:MY+]&63"O6&X/*E=91Q:GA
MQT_,#X[@]RA>W>!&6*$53--Q.DFBG]&XU?^NVM'(],'!)WTG!1ON^<>MD3E0
MM$5/%D3;>7=&\'$O_Z0[\AXW*&'OAAUPK(42SB/;F[6'J86Q+N@_#DMIF1&=
ML^6]#X/'P3\=Z!<:['VC,D2RO(MD>1O)<@C*8Z#PI#HXGNR#500)X?I*24WY
MDUQZ$S!#B/:7XS4U-M[I2WWQ(2-9DLR2-$\&0>2/!BB#5,K=0\1!V.H-DEI(
M)*(FU?<MV;Z%#1I1"^^@Y\[T^.*/^1"F#?YWI$PKB$\8^5\2LQVR Q*K&$HR
MB;*[Q0&Y;*FDBJPOLF@6)3>[0[)!P]!Z,HLHW6^B:]$=B,VZ][7L(H_F/E3#
M^J YX\O;AJSY93HA:3[?"R*E!4?Z!\1&GQJ$T!CZ4*[A]/6[]V]/X$JX!IP_
MJ;64^NJF:3'LPIUB4'EP8(QOMIH-;8O#5>/Q;Q']L6N$!>E;@#?VI(Y33CNG
MS8,"OI>$PEV,%P7\+4L_[!C#P6 NFV?_P-[3R:(8)_E!S,[F!411-!J=!O3?
MS#%HJ/5]V7<<$R: ED^ [9,Z&I+X[=:75C\\%###C-63.E\D:5;E25Z-L_$4
M\YQ.IU6=S.;PW+_UQ:!TJGOE-?R7)566S'D]6?!\EDPJ.E[0%!=ICOF4)FSF
MLWD9T]4R'J;&^&:"C(=Q\BM02P$"% ,*    "  (>#8X43](*MX"  !5"@  
M$@              I($     97AE8W5T:6]N7VQO9RYH=&UL4$L%!@     !
-  $ 0     X#      $! 
end


Mime
View raw message