harmony-alerts mailing list archives

Site index · List index
Message view « Date » · « Thread »
Top « Date » · « Thread »
From nom...@intel.com
Subject [build-test alert] FAILED Windows 2003 x86: classlib debug
Date Tue, 22 Jan 2008 08:55:37 GMT

BUILD FAILED:
	Ant Error Message:
C:\cc\cc-short\scripts\cc-exec-adaptor.xml:104: The following error occurred while executing
this line: C:\cc\cc-short\adaptors\classlib\adaptor.xml:28: The following error occurred while
executing this line: C:\cc\cc-short\build\checkouts\classlib\build.xml:282: The following
error occurred while executing this line: C:\cc\cc-short\build\checkouts\classlib\make\depends.xml:403:
The following error occurred while executing this line: C:\cc\cc-short\build\checkouts\classlib\make\depends.xml:478:
...  File depends/jars/bcprov-jdk15-138/bcprov.noidea.jar has incorrect md5 checksum.    
Expected: 7e2cf5f39012b303b4246e33a66bf078 (or )     Found:    30baee3d2b5bfb151b8024faf6a893f8

Date of build:	2008-01-22 14:53:13 +0600
Time to build:	2 minutes 2 seconds
Last changed:	01/22/2008 14:31:57
Last log entry:	Updating bcprov downloads to use apache server.

***********************************************************
Errors/Warnings:	(18)
            
Checking depends/jars/yoko_M2-20070130/yoko.jar
Checksum verified (true)
Checking depends/jars/yoko_M2-20070130/yoko-core.jar
Checksum verified (true)
Checking depends/jars/yoko_M2-20070130/yoko-rmi-impl.jar
Checksum verified (true)
Checking depends/jars/yoko_M2-20070130/yoko-rmi-spec.jar
Checksum verified (true)
Checking depends/jars/bcel-5.2/bcel-5.2.jar
Checksum verified (true)
Checking depends/jars/xalan-j_2.7.0/xalan.jar
Checksum verified (true)
Checking depends/jars/xerces_2.9.1/xerces.zip
Checksum verified (true)
Checking depends/jars/junit_3.8.2/junit.jar
Checksum verified (true)
Checking depends/jars/bcprov-jdk15-138/bcprov.noidea.jar
The execution FAILED with the following exception:
The following error occurred while executing this line:
C:\cc\cc-short\adaptors\classlib\adaptor.xml:28: The following error occurred while executing
this line:
C:\cc\cc-short\build\checkouts\classlib\build.xml:282: The following error occurred while
executing this line:
C:\cc\cc-short\build\checkouts\classlib\make\depends.xml:403: The following error occurred
while executing this line:
C:\cc\cc-short\build\checkouts\classlib\make\depends.xml:478: ...

File depends/jars/bcprov-jdk15-138/bcprov.noidea.jar has incorrect md5 checksum.
    Expected: 7e2cf5f39012b303b4246e33a66bf078 (or )
    Found:    30baee3d2b5bfb151b8024faf6a893f8

***********************************************************
Unit Tests: (0)
        
No Tests Run: This project doesn't have any tests

***********************************************************
Modifications since last successful build:	(2)
            
modified hindessm  /harmony/enhanced/classlib/trunk/make/depends.properties 01/22/2008 14:31:57
Updating bcprov downloads to use apache server.
modified hindessm  /harmony/enhanced/classlib/trunk/make/depends.xml 01/22/2008 14:31:57 Updating
bcprov downloads to use apache server.

begin 644 execution_log.zip
M4$L#! H    ( /%V-CAP2!OYP (   <*   2    97AE8W5T:6]N7VQO9RYH
M=&ULS59+;]LP#+X'Z'_094A[D)]YU<L"#&T##.B ';K34A2R1-=*9,F0Y#3I
MKY_DN&O:=1M6#$L-'R12_/B)(DA.2UN)V317;#N;UAIF4X*,W0KXT"^4M-CP
M>\C0)'KWOC\[ZC4U(Q:P6<OLJ(?\]PTV0*_15[^NR I"!C5(9H)-)?YTI-:J
M!FTYF*<GG^[F8&G)Y2V"C04MB4#<0H6XM KU*\4: 2:D2M)&:Y V-)9(1C3K
M/W/?4F>/*,Y<PYH;KB0:Q8-X& 6_H_%@_Z+944\W/B3G32TX;<^YRRV!6B1)
M!8XLXE6MM W0ETY^I6I\"6L0J O#%C$HN.36(9O=VL$47!OK[<^R!:7NQZ9T
M. M#-:^M63S&T$<<N:LC<DN\OY],\H8+MJ ET)5JG"D5Q!C!\X5_E&= _DJ%
M#SSN'BOS$LS4G12*L,?7IZ6Z1F<>TS]1=SA<$FW"K5JIF\\)3J)H',5IU H"
MIVJA-! AMON(K;!2:\ %%X!Y@?.7/9FF0FO0O. N0,=6-W#R:CZ8*@UOCI2N
M.'8)(]XD,5,#/2"QG(+ PR#YL3@@EPT11.+E31*,@VBW.R0;T!2,(W,:Q-TF
MN.?U@=@L&U?+;M)@XIZJ71\T9UQY6^,E6\5#'*>33A!(Q1F05Q#K796 ?&-H
M?+E&\X^?+B_.T1VW);).4R@AU-VN:5&H_9FL-=E3:*TT4K1M6PS=E0[_ =&I
M;<D-$JX%.&?/ZCAAI+9*[Q7P3N(+=Y9,,O2O//VR8[2*SEWR'_RU'6IOLL@&
M47H0MV,7W2 (>KVY1__+'$,E,:XONXZC_010L2&B75(';1)?;%QI=<-#AL:0
MT&)8I*=1G.1IE.:#9#""-"6C45Y$XPDZ=G<]:8WFJI'.PGUIE!. E"7Y,"_R
M>!CGDR@9%*08D<EI6DQ<-D]#,IN&[9P7[F:^L!T OP-02P$"% ,*    " #Q
M=C8X<$@;^< "   '"@  $@              I($     97AE8W5T:6]N7VQO
<9RYH=&UL4$L%!@     !  $ 0    / "      $! 
end


Mime
View raw message