harmony-alerts mailing list archives

Site index · List index
Message view « Date » · « Thread »
Top « Date » · « Thread »
From nom...@intel.com
Subject [build-test alert] FAILED Windows 2003 x86: hdk debug
Date Tue, 22 Jan 2008 08:53:32 GMT

BUILD FAILED:
	Ant Error Message:
D:\cc\cc-common\scripts\cc-exec-adaptor.xml:104: The following error occurred while executing
this line: D:\cc\cc-common\adaptors\hdk\adaptor.xml:48: The following error occurred while
executing this line: D:\cc\cc-common\scripts\framework.xml:1070: Java returned: 1

Date of build:	2008-01-22 14:50:03 +0600
Time to build:	2 minutes 55 seconds
Last changed:	01/22/2008 14:31:57
Last log entry:	Updating bcprov downloads to use apache server.

***********************************************************
Errors/Warnings:	(14)
            
[cc-ant]: Test Suite 'hdk' execution. Repository updated: true
[cc-ant]: Result: failed.superiors = '${failed.superiors}'
[hdk]: Updating HDK workspace to revision: HEAD
BUILD FAILED
D:\cc\cc-common\build\checkouts\hdk\build.xml:334: The following error occurred while executing
this line:
D:\cc\cc-common\build\checkouts\hdk\build.xml:344: The following error occurred while executing
this line:
D:\cc\cc-common\build\checkouts\hdk\working_classlib\build.xml:282: The following error occurred
while executing this line:
D:\cc\cc-common\build\checkouts\hdk\working_classlib\make\depends.xml:403: The following error
occurred while executing this line:
D:\cc\cc-common\build\checkouts\hdk\working_classlib\make\depends.xml:478: ...
File depends/jars/bcprov-jdk15-138/bcprov.noidea.jar has incorrect md5 checksum.
Expected: 7e2cf5f39012b303b4246e33a66bf078 (or )
Found:    4f96fde27b8b053fa606962309589873
Total time: 2 minutes 49 seconds
The execution FAILED with the following exception:
The following error occurred while executing this line:
D:\cc\cc-common\adaptors\hdk\adaptor.xml:48: The following error occurred while executing
this line:
D:\cc\cc-common\scripts\framework.xml:1070: Java returned: 1

***********************************************************
Unit Tests: (0)
        
No Tests Run: This project doesn't have any tests

***********************************************************
Modifications since last successful build:	(2)
            
modified hindessm  /harmony/enhanced/classlib/trunk/make/depends.properties 01/22/2008 14:31:57
Updating bcprov downloads to use apache server.
modified hindessm  /harmony/enhanced/classlib/trunk/make/depends.xml 01/22/2008 14:31:57 Updating
bcprov downloads to use apache server.

begin 644 execution_log.zip
M4$L#! H    ( *YV-CAJE8\P=P0  +H4   2    97AE8W5T:6]N7VQO9RYH
M=&ULW5A+;^,V$+X;R'^82['I00]+?JK> .EZ@Z1->N@FVT-L&!1%18PE42 I
M/_;7=RC9V<1)'&6WV+81;(@4A\/Y9CC#&8X2G:5'HU!$ZZ-1(=G1B(#2ZY2]
M?Q>+7%N*?V$!#-R??GEW=- JBXAH9JE%'ART#EJR-&\PSS6CB9C"=1+-IP%<
M&3J>W\#I^'=8"CE7!:$,M #)%EQQD0=P^O%X?#=YQ>@4CO7=,/3:G79G:&\)
M;LF"3.'7DJ=1S%.4*#1->Y6E#RD>]E!.JY"B"/81\9SKO00J$<N98:-VR.X#
M?W[DB><8M9$P."4R$_D:3EC$).HUJ@$V8_6^\=.,'^K*:/_KAP V1F@V7Q0&
M@[&Y6BO-,C-_R?-(+%4S!D32A&M&=2G95H#5H&?Y7L/YN0:A("<9<PPO,_^O
M6@#P7-=WD%DS3HE0%9#?D&HK2=ONVNZL[<+AIS*'"TZEJ'$J.,NI_7,SSM6N
MA4Q$[*N2(Q:6-PUU7.JBU) *BII&)S'3-9$W3#>;/_[S_/,%T)0HE?*P7MZV
MG?IGW!11S[;#S5A^^OP'2"'TW0=DF6B-ON(XN*5L4FUU6\@;1[)"*(>H^&7.
M>]V1Z7+7HTTK8BG3; IC\S;FB[C$W23D&L;!A%+\651DZ'&3R@P3E(O.4:5J
M@D%K\IP>K[,Y,IK"!\DJ%\5.\,T,=Y LN:;)#-4T6V1/QY9F<?%9MEM;[F%^
M9=H9F;-)Q J61^IQ4-U/;B(CDYJSI_V\GE6=&]'] ^"52&ZCN18B?28$?Z^:
M*BM*ID0I*?L'URA$4::(?%9SWGO,D%*+6<R,3%NSS?"_*\W#WLOTEW)MG $U
M+Q9,2HZA1V ,BEAL#CZ#0\081-0<:#)79?;B:M;&\'OELC#LYJD@T9XC\X-Q
ME\I1:X;.+9'*68NYF%UX%H;LOMOVW>J#C4-[ET/G3-/U<ZL^(LY0%Y9))"P>
M6^'+4J)> +7'8XZ;^%#+DNT)^*_ A?%#LC<+3F;<XEF1OFF JF#T#0 ,*4NM
MKNW=-=X IA5)26[=SCR[;[MU[RV@8N:,0E!#N[WIV%]X\3]'=5OB:33S[0%N
MP:K]!BP54LR-%A:F+NVNU?8'FP]V+O 4)C\8X$XE?75V/H:3X[/SC^.'(TU2
MV[OB._#]3@"76,O&(DW%TJ@ DPPA05!:2HFJ6R8H$ICLJ:RR<IUP!2G/=Y.A
M5Z[;^9'K[I9&]P3Q!MZ_*<ANXAYT7/^_)4]_$&"-N3=+/C$"O=)S("$*>([Y
MDRGR((NZ0#=N:S_VTX\K/*6Q  F@SSP:=V-_Z+:]T'?]L.-U>LSW2:\7QFY_
M (>HJR<\_424.4['IQ,/>W'$O'XX"-VN'Y.>VQOV/-\==@?#0=_?A_12:)*"
MYAD+P(.,YZ5F"CI#+&JI0/0'K9:QW<8XF)O7'@I8JB1HJ =675%6&)J@]<WF
MWC4QB4B!!7-MVTVGMN+@.S;5[BJ*2E[@!HHER9C90=42;4RL@OK*16*%+W-C
MK7;KH#5RR-'(J:XFG?J:TJGN+/\&4$L! A0#"@    @ KG8V.&J5CS!W!   
MNA0  !(              *2!     &5X96-U=&EO;E]L;V<N:'1M;%!+!08 
1     0 ! $    "G!      ! 
end


Mime
View raw message