harmony-alerts mailing list archives

Site index · List index
Message view « Date » · « Thread »
Top « Date » · « Thread »
From nom...@intel.com
Subject [build-test alert] FAILED Linux ia64: classlib debug
Date Tue, 22 Jan 2008 08:49:21 GMT

BUILD FAILED:
	Ant Error Message:
/export/users/cc/scripts/cc-exec-adaptor.xml:104: The following error occurred while executing
this line: /export/users/cc/adaptors/classlib/adaptor.xml:49: The following error occurred
while executing this line: /export/users/cc/build/checkouts/classlib/build.xml:282: The following
error occurred while executing this line: /export/users/cc/build/checkouts/classlib/make/depends.xml:403:
The following error occurred while executing this line: /export/users/cc/build/checkouts/classlib/make/depends.xml:478:
...  File depends/jars/bcprov-jdk15-138/bcprov.noidea.jar has incorrect md5 checksum.    
Expected: 7e2cf5f39012b303b4246e33a66bf078 (or )     Found:    fa26d62c676da54da3dc705da6654128

Date of build:	2008-01-22 00:48:10 -0800
Time to build:	53 seconds
Last changed:	01/22/2008 00:31:57
Last log entry:	Updating bcprov downloads to use apache server.

***********************************************************
Errors/Warnings:	(21)
            
[cc-ant]: Test Suite 'classlib' execution. Repository updated: true
[cc-ant]: Result: failed.superiors = '${failed.superiors}'
[cc-ant]: Do cleanup for /export/users/cc/build/checkouts/classlib
Checking depends/jars/yoko_M2-20070130/yoko.jar
Checksum verified (true)
Checking depends/jars/yoko_M2-20070130/yoko-core.jar
Checksum verified (true)
Checking depends/jars/yoko_M2-20070130/yoko-rmi-impl.jar
Checksum verified (true)
Checking depends/jars/yoko_M2-20070130/yoko-rmi-spec.jar
Checksum verified (true)
Checking depends/jars/bcel-5.2/bcel-5.2.jar
Checksum verified (true)
Checking depends/jars/xalan-j_2.7.0/xalan.jar
Checksum verified (true)
Checking depends/jars/xerces_2.9.1/xerces.zip
Checksum verified (true)
Checking depends/jars/junit_3.8.2/junit.jar
Checksum verified (true)
Checking depends/jars/bcprov-jdk15-138/bcprov.noidea.jar
The execution FAILED with the following exception:
The following error occurred while executing this line:
/export/users/cc/adaptors/classlib/adaptor.xml:49: The following error occurred while executing
this line:
/export/users/cc/build/checkouts/classlib/build.xml:282: The following error occurred while
executing this line:
/export/users/cc/build/checkouts/classlib/make/depends.xml:403: The following error occurred
while executing this line:
/export/users/cc/build/checkouts/classlib/make/depends.xml:478: ...

File depends/jars/bcprov-jdk15-138/bcprov.noidea.jar has incorrect md5 checksum.
    Expected: 7e2cf5f39012b303b4246e33a66bf078 (or )
    Found:    fa26d62c676da54da3dc705da6654128

***********************************************************
Unit Tests: (0)
        
No Tests Run: This project doesn't have any tests

***********************************************************
Modifications since last successful build:	(2)
            
modified hindessm  /harmony/enhanced/classlib/trunk/make/depends.properties 01/22/2008 00:31:57
Updating bcprov downloads to use apache server.
modified hindessm  /harmony/enhanced/classlib/trunk/make/depends.xml 01/22/2008 00:31:57 Updating
bcprov downloads to use apache server.

begin 644 execution_log.zip
M4$L#! H    ( "8&-CB[;F8USP(  !<*   2    97AE8W5T:6]N7VQO9RYH
M=&ULS59+;]LP#+[[5_ RM#OX$3NO>EF 86V  1VP0W<JBD*1Z%JI+!F2G$=_
M_6@G79NUQ=!A:*J31(D?/Y$$R4GI*S6=S(W83">UQ>F$@?,;A9^/"J-]Z.0=
MYC!./GPZF@9-+9C'T"UU'D"[+I&7Y@HN.0^9]E<YG!K@"IEN:BB,A1C7M;$^
M;AQ:%W,>SQNI1,Q+Y+>F\212S#DEY_=P:^17\+/=5^P68X$U:N&B=:7^\J*V
MID;K);J]AWN'&7I>2GT#N/9H-5,@/58@M3=P5!G1*"1&1O/&6M0^=IYIP:PX
MVK?=.4$\@)"VQ:5TTF@8]OJ]_CAZF<.]]G-*@6W(L:=-K23O'M&G%L@]:%8A
MT019M=Z,X,=.?F'J\!R7J&#W_0T(+*26GF#==D\PA;3.M_I/PN&XE36%X<%[
MK:N!O@WLAK46GU%Z*89Q%Y!]J" H6J>'NS#E01 *L]+*,+&?0E];N#8VNY?Q
M@I&UC;DUU]_3,$V24=++DDX0T17A6&1*;1[!M:+*+#$LI,)0%N'\62.NJ6")
M5A:27'/L;8,?_Y5)R(W%=T3'5C*D'%'OC)*KD1^$TIRC"@=1^GMS$!9KII@.
M%]=I-(J2[>DP/-!R=$3C).KM#M&=K-^<QZ*A G6=16,*3+<_4&Y0I5J&"W';
M&X2];+P31-I(@>QUE(*+$J&M[TU;>&'VY=OYV2FLI"_!TTUAE#*K;>/A6+=O
M\D[ET86UU"X-[UJ/@%5)\/>(=.U+Z4!1,<^#)^68"59[8Q_5X9VDK;]Y_R2'
M_V;JQ<K?773VTG'Z%@;_G [R?I(=QNYHG$,44?.>M?"O3#$HF:,>2VW$MOV\
M$@/@NY3>SA!G:ZJ=- KD,,*4%X,B.TEZZ3Q+LGD_[0\QR]AP."^2T1B.Z;/;
MQ)^91I,&K8*E0S%,^7 T%&S0%RP3?)0,!"D-^KUT'$QB-IW$W=P7;V? N!L(
M?P%02P$"% ,*    "  F!C8XNVYF-<\"   7"@  $@              I($ 
K    97AE8W5T:6]N7VQO9RYH=&UL4$L%!@     !  $ 0    /\"      $! 
end


Mime
View raw message