harmony-alerts mailing list archives

Site index · List index
Message view « Date » · « Thread »
Top « Date » · « Thread »
From nom...@intel.com
Subject [build-test alert] FAILED Linux x86: hdk debug
Date Tue, 22 Jan 2008 08:47:18 GMT

BUILD FAILED:
	Ant Error Message:
/export/users/cc/cc-common/scripts/cc-exec-adaptor.xml:104: The following error occurred while
executing this line: /export/users/cc/cc-common/adaptors/hdk/adaptor.xml:48: The following
error occurred while executing this line: /export/users/cc/cc-common/scripts/framework.xml:1070:
Java returned: 1

Date of build:	2008-01-22 14:44:26 +0600
Time to build:	2 minutes 27 seconds
Last changed:	01/22/2008 14:31:57
Last log entry:	Updating bcprov downloads to use apache server.

***********************************************************
Errors/Warnings:	(11)
            
BUILD FAILED
/export/users/cc/cc-common/build/checkouts/hdk/build.xml:334: The following error occurred
while executing this line:
/export/users/cc/cc-common/build/checkouts/hdk/build.xml:344: The following error occurred
while executing this line:
/export/users/cc/cc-common/build/checkouts/hdk/working_classlib/build.xml:282: The following
error occurred while executing this line:
/export/users/cc/cc-common/build/checkouts/hdk/working_classlib/make/depends.xml:403: The
following error occurred while executing this line:
/export/users/cc/cc-common/build/checkouts/hdk/working_classlib/make/depends.xml:478: ...
File depends/jars/bcprov-jdk15-138/bcprov.noidea.jar has incorrect md5 checksum.
Expected: 7e2cf5f39012b303b4246e33a66bf078 (or )
Found:    055fae55568b4ead7dc49a99c2368580
Total time: 2 minutes 19 seconds
The execution FAILED with the following exception:
The following error occurred while executing this line:
/export/users/cc/cc-common/adaptors/hdk/adaptor.xml:48: The following error occurred while
executing this line:
/export/users/cc/cc-common/scripts/framework.xml:1070: Java returned: 1

***********************************************************
Unit Tests: (0)
        
No Tests Run: This project doesn't have any tests

***********************************************************
Modifications since last successful build:	(2)
            
modified hindessm  /harmony/enhanced/classlib/trunk/make/depends.properties 01/22/2008 14:31:57
Updating bcprov downloads to use apache server.
modified hindessm  /harmony/enhanced/classlib/trunk/make/depends.xml 01/22/2008 14:31:57 Updating
bcprov downloads to use apache server.

begin 644 execution_log.zip
M4$L#! H    ( .=U-CA6V(W_3 0  %P4   2    97AE8W5T:6]N7VQO9RYH
M=&ULW5A9;]LX$'[WK^#+HMD'W3YDU0V0;1IL%LD^;-.^!(% 4:.(L20*).6C
MOWZ'DI/62>PH:;';5/ ABISCF^$,9S3+=5D<SA*1K@]GM83#&25*KPMX]R83
ME;84_P(1"=W?WKXY'#1U2C58:E%%@X%L\)>8ZQ)6P*[(D282%EQQ49&Q-_2&
MH;V9OZ$+>D7^:'B19KQ ?HFYM5=EL;5@:X!"K%J*.MJ]A%=<[YE6N5C&AH7:
M7K31F>7B'L&W$X]<1S5E.9 _J2Q%M28GD()$<Z0=L%Z<WO6^>K%#&QF3?WT0
MD8WE>Y&+V@#@U351:Z6A-.0%KYI5+VHJ6<XU,-U(N!6^"L=6X/<CKS01BE2T
M!,>P,N1G1KC#@W#<BT4N5*O]7[CJ5@//'MEN[([)P<>F(N><2=&!4^2T8O;O
MO1BWVY.4(H6O=DTA::[[F;71=:-)(1@:%V/!4&LJKT'W(C_^Y^SS.6$%5:K@
M22?<MIWNLQ1RCI#CV^E>'#]^_IM((?3= ^28:XUQX3BXA6S:;FQ;R&M'0BV4
M0U7V).,]<0>ZJ1^$W&4*!6BX(L?FW[@MY1)WCY!KXL"J%E([C0*I',;P8S%1
M8I@YK2L<5(_-T:[*R=.YL\.8E^4<65Z1]Q+:L,1!] -8;V-;<LWR&*T6+\I'
MTTJO5+B+YZU;=W/^9.Y+.@<GA1JJ5#W(HOM7FWP(4G-0NXG:+)\2+5X&XB:=
M:R&*Q[/N]YFG=9P$)1K)X$<)J$7=%(@X[MCN.5%HHT6<@5'GUE,Q?M4>DB=7
M7\BU"08TMEB E!QSCL#DDT)FCC<#0&28/M2<L'RNFO()4=;&T7M4LE*QK I!
MT]W'XGL3%&V,=MR<&XK1LQ9S$9_[EN^Z$]<+W/:!C5-[9&$L%L5ZA\C[2TLT
M@64J!(MG5O*D@F@-@C;C&<?=>J!E [O3^S,087Z0\ O"DB6W>%D7OR@T50-[
MU= 2!H4ULOV[FU>-9D4+6EDWL6]/;+<;O6X\8(X<A#.UO<W _L+K5XOGIL'C
M)0[L$#=<>_^JO9,P+&P6%I8>WLCR@G#SP*X$'JCTOX.VW?!^.CT[)B='IV<?
MCK<FGEF4WG7+41 ,(W*!36@FBD(LC1FP9A"2",8:*=%ZRQQ5(Z8*:MHB6^=<
MF:;N7EGS<@V&_X\&]QN?;U3R0__G4.E^61X-W>!GU6P21MA5[JF*3XQBSXPQ
MDE-%>(7UD^GL2)F."-O$M_T@H#^L\,#&/B,B$_!9-LJ"J>OY2> &R= ?CB$(
MZ'B<9.XD) =HLH<9X40T%5+CY8Y&&871:#0.DR'0=)*RX91.I\P/QN$H='>C
MO!":%D3S$B+BDY)7C09%O"DVL4P@\L' N&_C'ZS%NV FV)+DZ*LMQZX8U&9-
M-'BIQ_=XF::TQE:Y<^]FT#DR?/D.VR-/,<EKW$V9I"68[=0*\[#FBKK7+1*;
M?%D9[WF#F4,/9T[[\M#I7B0Z[5O%?P%02P$"% ,*    " #G=38X5MB-_TP$
M  !<%   $@              I($     97AE8W5T:6]N7VQO9RYH=&UL4$L%
3!@     !  $ 0    'P$      $! 
end


Mime
View raw message