harmony-alerts mailing list archives

Site index · List index
Message view « Date » · « Thread »
Top « Date » · « Thread »
From nom...@intel.com
Subject [build-test alert] FAILED Linux x86_64: classlib debug
Date Tue, 22 Jan 2008 08:47:16 GMT

BUILD FAILED:
	Ant Error Message:
/export/users/cc/cc-short/scripts/cc-exec-adaptor.xml:104: The following error occurred while
executing this line: /export/users/cc/cc-short/adaptors/classlib/adaptor.xml:49: The following
error occurred while executing this line: /export/users/cc/cc-short/build/checkouts/classlib/build.xml:282:
The following error occurred while executing this line: /export/users/cc/cc-short/build/checkouts/classlib/make/depends.xml:403:
The following error occurred while executing this line: /export/users/cc/cc-short/build/checkouts/classlib/make/depends.xml:478:
...  File depends/jars/bcprov-jdk15-138/bcprov.noidea.jar has incorrect md5 checksum.    
Expected: 7e2cf5f39012b303b4246e33a66bf078 (or )     Found:    db7e79ae72c32350a684adcc3f31a4a0

Date of build:	2008-01-22 14:46:28 +0600
Time to build:	33 seconds
Last changed:	01/22/2008 14:31:57
Last log entry:	Updating bcprov downloads to use apache server.

***********************************************************
Errors/Warnings:	(18)
            
Checking depends/jars/yoko_M2-20070130/yoko.jar
Checksum verified (true)
Checking depends/jars/yoko_M2-20070130/yoko-core.jar
Checksum verified (true)
Checking depends/jars/yoko_M2-20070130/yoko-rmi-impl.jar
Checksum verified (true)
Checking depends/jars/yoko_M2-20070130/yoko-rmi-spec.jar
Checksum verified (true)
Checking depends/jars/bcel-5.2/bcel-5.2.jar
Checksum verified (true)
Checking depends/jars/xalan-j_2.7.0/xalan.jar
Checksum verified (true)
Checking depends/jars/xerces_2.9.1/xerces.zip
Checksum verified (true)
Checking depends/jars/junit_3.8.2/junit.jar
Checksum verified (true)
Checking depends/jars/bcprov-jdk15-138/bcprov.noidea.jar
The execution FAILED with the following exception:
The following error occurred while executing this line:
/export/users/cc/cc-short/adaptors/classlib/adaptor.xml:49: The following error occurred while
executing this line:
/export/users/cc/cc-short/build/checkouts/classlib/build.xml:282: The following error occurred
while executing this line:
/export/users/cc/cc-short/build/checkouts/classlib/make/depends.xml:403: The following error
occurred while executing this line:
/export/users/cc/cc-short/build/checkouts/classlib/make/depends.xml:478: ...

File depends/jars/bcprov-jdk15-138/bcprov.noidea.jar has incorrect md5 checksum.
    Expected: 7e2cf5f39012b303b4246e33a66bf078 (or )
    Found:    db7e79ae72c32350a684adcc3f31a4a0

***********************************************************
Unit Tests: (0)
        
No Tests Run: This project doesn't have any tests

***********************************************************
Modifications since last successful build:	(2)
            
modified hindessm  /harmony/enhanced/classlib/trunk/make/depends.properties 01/22/2008 14:31:57
Updating bcprov downloads to use apache server.
modified hindessm  /harmony/enhanced/classlib/trunk/make/depends.xml 01/22/2008 14:31:57 Updating
bcprov downloads to use apache server.

begin 644 execution_log.zip
M4$L#! H    ( .-U-CB93TUONP(  /X)   2    97AE8W5T:6]N7VQO9RYH
M=&ULS59+;]LP#+[[5^@RI#OXG<2.EP48U@88L $[=*>A*&2)KI7(DB')>?37
M3W+<1X9V0X>AJ9&#1)$?/TH,R7EM&KZ8EY+N%_-6P6*.D39[#A]'E13&U^P6
M"I1'[SZ,%E[74FS UQM1>,A]/V$'Y K]<.L&KR&DT(*@.M@U_"\:K9(M*,- 
M'RD>;99@2,W$#8*= 24P1\Q @Y@P$HT:23L..B12D$XI$";4!@N*%1T=^^Y9
MTP<0:ZU@PS23 DWC<3S.@^<YW%D_9>2ISM[$>==R1GHE&]0*B$$"-V!I(M:T
M4ID ?1_DE[+UO\(&.!K"WR,*%1/,6%A]6%N8BBEMG'T(.P<0=AJ4C938GZ]K
M)]%$L=;H\.$:W9TC&S_"-]BY_I-UV3%.0U(#6<O.HA".M>:L#/LG.L;TO,H]
M@S\\7.%Y/I5;P26F]UE :GF%/CLX]UJ#9KC"UNU>KN7UM\1/HBB+XC3J!8$]
MLC@*,.?[1W!.U,@-^!7CX+/*+Y]THKL&;4"QBMG+.C.J@_?_RL0G4L$;HJ,:
MYMNLX6^,DFZ!G(1228#[DR"Y7YR$Q0YS+/S5=1)D0738G88'* +:TI@%\; )
M;EG[ZCQ6G2U9UVF0VX?IUR?*#5NI-OZ*KN.)'Z?Y( B$9!3PRRAYES4@5_$[
M5XK1\M.7KQ?G:,M,C8P]J23G<GMH101:IU/T)H\.E)(*2=(W(XJVM86_0[3'
MIF8:<5O>"^_YNHPI;HU4CPKR('&%N!C/"O3_?3[;"_J#WG&2)Z_J^?=1HAA'
MZ8D)9'F!@L"V_*7S\\(T1#76MB';5J/<%-#0"2)#VA\FCXN=K:]V@"A0!@FI
M)E4ZB^*D3*.T'"?C*:0IGD[+*LIR=&:C/OPYEK(3UL)^M,P@FV'($I(FZ23"
MTWR,*2%IE<9XC"-O'N+%/.S'N_ PZH7]W/<+4$L! A0#"@    @ XW4V.)E/
M36^[ @  _@D  !(              *2!     &5X96-U=&EO;E]L;V<N:'1M
7;%!+!08      0 ! $    #K @     ! 
end


Mime
View raw message