harmony-alerts mailing list archives

Site index · List index
Message view « Date » · « Thread »
Top « Date » · « Thread »
From nom...@intel.com
Subject [build-test alert] FAILED Windows 2003 x86: jdktools-test
Date Tue, 22 Jan 2008 04:48:53 GMT
svn.revision=613602
BUILD FAILED:
	Ant Error Message:
C:\cc\cc-suites\scripts\cc-exec-adaptor.xml:104: The following error occurred while executing
this line: C:\cc\cc-suites\adaptors\jdktools-test\adaptor.xml:68: The following error occurred
while executing this line: C:\cc\cc-suites\scripts\framework.xml:1079: Java returned: 1

Date of build:	2008-01-22 10:47:41 +0600
Time to build:	1 minute 4 seconds
Last changed:	01/21/2008 16:47:14
Last log entry:	snapshot

***********************************************************
Errors/Warnings:	(11)
            
BUILD FAILED
C:\cc\cc-suites\build\checkouts\hdk\build.xml:334: The following error occurred while executing
this line:
C:\cc\cc-suites\build\checkouts\hdk\build.xml:344: The following error occurred while executing
this line:
C:\cc\cc-suites\build\checkouts\hdk\working_classlib\build.xml:282: The following error occurred
while executing this line:
C:\cc\cc-suites\build\checkouts\hdk\working_classlib\make\depends.xml:426: The following error
occurred while executing this line:
C:\cc\cc-suites\build\checkouts\hdk\working_classlib\make\depends.xml:474: ...
File depends/libs/windows.x86/icu-3.4/icu-3.4.zip has incorrect md5 checksum.
Expected: 4ab256e309d1ceb9779b10cf32c79dab (or )
Found:    f8b46d05e08ca98e42738f159ae1dd40
Total time: 58 seconds
The execution FAILED with the following exception:
The following error occurred while executing this line:
C:\cc\cc-suites\adaptors\jdktools-test\adaptor.xml:68: The following error occurred while
executing this line:
C:\cc\cc-suites\scripts\framework.xml:1079: Java returned: 1

***********************************************************
Unit Tests: (160)
        
All Tests Passed

***********************************************************
Modifications since last successful build:	(1)
            
add cc-snapshot log20080121164714Lbuild.70 01/21/2008 16:47:14snapshot

begin 644 execution_log.zip
M4$L#! H    ( !A6-CA^V(3NH00  !T:   2    97AE8W5T:6]N7VQO9RYH
M=&ULW5E+<]LV$+YKQO\!ET[< _@0]:!4QS-)'$_=27IHTO00>300L QAD00'
M /7(K^^"E)Q(=F0Z;=)&'#T(<+'8;[_=Q0 \2VV>G9_-E%B?GY4:SL\8,7:=
MP=,GB2HL-?(CC$D<_/3+D_.33E4*9H&:13$^Z9QTJ %;E?1&S*U2F:%+TW1O
MQ';[B;O>PPKX-7EFB8:%-%(59!!&@Z#K;05NV()=D^>5S$0B,YQ[YFZ]59[M
M2NRVT")::E6.#PG)0MJ# B95RZE38_;$-K;S5.T/^?S)/=>SDO$4R*],YZI8
MDTL0H-$UH@'83M73UE<[?>@KY_U/'6.R(:'=>%4Z#++X0,S:6,C=^*4LA%J:
M=@J8YJFTP&VE86O *A[0J*4!K+!$&5*P''RGRXW_JS& =(,@\E%9.TVI,C60
MWU!J:TGH];U@&L3D]$U5D->2:]7@-.2JX-[/[33744MR)>"3DS5DP RT]')E
MR\J23''T-::)4V"9_@"VW?B+/UZ]>TUXQHS)Y*PQP//\YK-4>HZXI]O'[52^
M>?<[T4K9VPY4F5J+V>+[&%0>JX/=4_J#KZ%4QF<F>5CSP81T]>5N+KX7Z$D+
MU^3"_3L"A=083TJOR8OQA'/\4%-AC)E)3<0$[>)S=*F9I&(^^9(?W^=S5'1-
M7FBHDQ0;XZ]6N(=D*2U/I^BFZ2*_O[JTJXQ?5+OE\ILHWY;R;V.YRK$Z:C"J
MTAS^Q3E*5589,CEM-!^L_:RR:IJ LVGKR2E^]ZW9;3TL_U:O77Q:1=0"M)98
M#Q06!@&)6XT<#I5@7ILYX>G<5/F#LU$!)13BL%T4:V&1*28.K&,O7 37N=,H
M]&^8-OY:S=7T=9=B'1T&8134'1X^.C@=YDN6K;\TZQWA''U!W>I.94)G#UN)
M?B'H/9E(3,I3JRLX4(4?@8MRI>%HP>E<4IF7V5$#-"7P(P XXY#1OM>]O3D"
M3"N6L8+>3+O>T N:UC&@ K=&(:B1%VX:WD=9_N"H;BI<C::1%V,(UO='P-2,
MXU9NX7:A89^&4;SI. )D^:IW@V0%2):[/8;X VO7S2\=(+#@"%CZ'%-E979D
MP SH!>Z^*"LE[7K]8T G (4JZ@Z^;AO6)@@OC&EX!&DF0,_6- R\R N]7M/\
ML2ES6RY_<_KDK>*!+WE%(\2V^?_.I.VVGO]Y]>J"7#Z[>O7R8O=)FT.%VX//
M<13UQN1M"B116::6#C_N)94FBO-*:_3;,D63B-LD5_5YB$VE(9DL]O>\CYRW
M]SWGW3^4^LR0;MS]+PW)V1PFFXBK[>EU!_\O>X9(E.<=/ RY= 8])FU(R@R1
M!>Z1W=D:R46?\$W">G<S].4*=V(6Q)CTV*S;'T 4C$3(838:#D>S,.!)U.7#
MD6 S<HJ.NB?'+U55X'"\DGC6&XB@#T',V2B&7G<8Q4G8'S$(A>@%AV"^599E
MQ,H<QJ0?$P-<(>"33L?1M>%#%9ND)$MI4^1FA\@5A]+)C#M?S? ^JTRPTBIM
M)K>O1+#7;KMK"@?Q/XBH_?D,U[+$Z$DTR\&%3SU%& Q'X^:L6X.M=.'8"CLG
MG3.?G9_Y]=L?OWD3Y->OA?X&4$L! A0#"@    @ &%8V.'[8A.ZA!   '1H 
M !(              *2!     &5X96-U=&EO;E]L;V<N:'1M;%!+!08     
. 0 ! $    #1!      ! 
end


Mime
View raw message