harmony-alerts mailing list archives

Site index · List index
Message view « Date » · « Thread »
Top « Date » · « Thread »
From nom...@intel.com
Subject [build-test alert] FAILED Windows 2003 x86_64: jdktools-test
Date Mon, 21 Jan 2008 16:04:19 GMT
svn.revision=613602
BUILD FAILED:
	Ant Error Message:
C:\cc\cc-suites\scripts\cc-exec-adaptor.xml:104: The following error occurred while executing
this line: C:\cc\cc-suites\adaptors\jdktools-test\adaptor.xml:68: The following error occurred
while executing this line: C:\cc\cc-suites\scripts\framework.xml:1079: Java returned: 1

Date of build:	2008-01-21 19:03:06 +0300
Time to build:	1 minute 3 seconds
Last changed:	01/21/2008 14:53:13
Last log entry:	snapshot

***********************************************************
Errors/Warnings:	(11)
            
BUILD FAILED
C:\cc\cc-suites\build\checkouts\hdk\build.xml:334: The following error occurred while executing
this line:
C:\cc\cc-suites\build\checkouts\hdk\build.xml:344: The following error occurred while executing
this line:
C:\cc\cc-suites\build\checkouts\hdk\working_classlib\build.xml:282: The following error occurred
while executing this line:
C:\cc\cc-suites\build\checkouts\hdk\working_classlib\make\depends.xml:426: The following error
occurred while executing this line:
C:\cc\cc-suites\build\checkouts\hdk\working_classlib\make\depends.xml:474: ...
File depends/libs/windows.x86_64/icu-3.4/icu-3.4.zip has incorrect md5 checksum.
Expected: 39b2bb43ec0ec6f31567fd020e2c5338 (or )
Found:    53b383e6424103823493087e5dddff54
Total time: 58 seconds
The execution FAILED with the following exception:
The following error occurred while executing this line:
C:\cc\cc-suites\adaptors\jdktools-test\adaptor.xml:68: The following error occurred while
executing this line:
C:\cc\cc-suites\scripts\framework.xml:1079: Java returned: 1

***********************************************************
Unit Tests: (160)
        
All Tests Passed

***********************************************************
Modifications since last successful build:	(1)
            
add cc-snapshot log20080121145313Lbuild.72 01/21/2008 14:53:13snapshot

begin 644 execution_log.zip
M4$L#! H    ( (:8-3@%4@6;I 0  "@:   2    97AE8W5T:6]N7VQO9RYH
M=&ULW5G=D],V$'_/S/T/>NE 'R1_);E<>MP,<-ST.M"'0ND#N<DHTAKK8EL>
M2<X'?WU7=G*0 #E#"RWQY,.25ZO][6]7&JW/,U?D%^<S+=<7YY6!BW-.K%OG
M\.A!JDM'K7H'8S(*?_KEP<5)KZXD=T#MHAR?]$YZU(*K*WHKYT[KW-*E;;LW
M8KO]Q%]O8 7BACQVQ,!"6:5+,HR281BSK< M7_ ;\J16N4Q5CG//_"U;%?FN
MQ&X++:*5T=7XD) JE3LH8#.]G'HU=D]L8[O(]/Z0#Y]\XGI<<9$!^96;0I=K
M<@42#+I&M@"[J7K4^>JF#WWEO?^^8TPV)'0;KRN/095OB5U;!X4?OU2EU$O;
M30$W(E,.A*L-; U8C8;389\.^QU5E(YH2TI>0.#5>15_M3:0. R3@!>RJZY,
MVP;-;RBU-2=B Q9.HX@\?%F7Y(421K=@+;DN!?NYF^8F=$FA);SWM($<N(6.
MKJY=53N2:X$.QUSQ"APW;\%U&W_YQ_/7+XC(N;6YFK4&,!:TGZ4V<\0]W3[N
MIO+EZ]^)T=K==:#*S#E,F2# R&*\B7BFS=O 0*5MP&UZO^:#6>D7F8\3\HU$
M3SJX(9?^WQ,HE<&@TF9-GHXG0N"'VAH#S4X:(B9HEYBC2^TDD_/)Y_SXIIBC
MHAORU$"3J=@8?[7"/21+Y40V13=-%\6GEYANR^-GU6ZY_";*M^OYM[%<%[A$
M&K"Z-@+^Q3DJ7=4Y,CEM-1_< 'CM]#0%;]/6DU/\[ENSV[I?_I59^_ATFN@%
M&*-P/="X,$A(_9;D<>@4\]K.B<CFMB[NG8U*J*"4A^VBN!J6N>;RP&;VU$=P
MDSNMPN"6&QNL]5Q/7\045]+3,$K"IH/AHX/38;[D^?ISLWXD7* OJ-_BJ4KI
M['XKT2\$O:=2A4GYT)D:#JS"7X"+"FW@:,&90E%55/E1 [05B", .!.0TP&+
M[VZ. -.*Y[RDM].8G;*P;1T#*O![%((Z8]&FP=ZIZ@='=5OC;C1-V A#L+D_
M J9F L]S"W\4C08T2D:;CB- 5JSZMTA6B&3YVV.(/W!NW?[2(0(+CX"E#S'5
M3N5'!LR"6>#IB_)*T9@-C@&=!!2JJ:]^W36<2Q%>-*+1$:29!#-;TRAD"8M8
MOVW^V)3Y(U>P*4&QMI(4*%'3A-W]?V?>=EM/_KQ^?DFN'E\_?W:Y^Z1+7>&N
M #I.DOZ8O,J I#K/]=*[ (^3VA M1&T,NFZ9H4G$GY/KIB3B,F5)KLK]8^\7
MSMO_GO/NUZ4^,"0>Q?^E(06?PV03=(T]_7CX_[+G%(EB[& ]Y,H;](690S)N
MB2KQI.PK;*20 R(V:<L^SM-G*SR/.9!CDIS-XMFLGX (00S3)!H,3U,9QB'$
M8I D(_(0??6)3+_2=8G#\1HDLV24P+ ?]Z,P&<5)_RP)1Z<PD%*FZ:!_".DK
M[7A.G"I@3 8C8D%HQ'S2ZWG&-I3H<I.79*E<AO3L<+D24'F9<>^K2=XGEDM>
M.6WLY.[M"/:Z;7?#XG#T#X)J?SXKC*HP@%+#"_ 1U$P1A:=GX[;B;<#5IO1L
M1;V3WGG +\Z#YD50T+X4"IHW1'\#4$L! A0#"@    @ AI@U. 52!9ND!   
M*!H  !(              *2!     &5X96-U=&EO;E]L;V<N:'1M;%!+!08 
1     0 ! $    #4!      ! 
end


Mime
View raw message