harmony-alerts mailing list archives

Site index · List index
Message view « Date » · « Thread »
Top « Date » · « Thread »
From nom...@intel.com
Subject [build-test alert] FAILED Windows 2003 x86_64: classlib-test
Date Mon, 21 Jan 2008 14:14:45 GMT
svn.revision=613602
BUILD FAILED:
	Ant Error Message:
C:\cc\cc-suites\scripts\cc-exec-adaptor.xml:104: The following error occurred while executing
this line: C:\cc\cc-suites\adaptors\classlib-test\adaptor.xml:119: The following error occurred
while executing this line: C:\cc\cc-suites\build\checkouts\classlib\build.xml:282: The following
error occurred while executing this line: C:\cc\cc-suites\build\checkouts\classlib\make\depends.xml:426:
The following error occurred while executing this line: C:\cc\cc-suites\build\checkouts\classlib\make\depends.xml:474:
...  File depends/libs/windows.x86_64/icu-3.4/icu-3.4.zip has incorrect md5 checksum.    
Expected: 39b2bb43ec0ec6f31567fd020e2c5338 (or )     Found:    53b383e6424103823493087e5dddff54

Date of build:	2008-01-21 17:11:53 +0300
Time to build:	2 minutes 10 seconds
Last changed:	01/21/2008 14:53:13
Last log entry:	snapshot

***********************************************************
Errors/Warnings:	(32)
            
Checking depends/jars/yoko_M2-20070130/yoko.jar
Checksum verified (true)
Checking depends/jars/yoko_M2-20070130/yoko-core.jar
Checksum verified (true)
Checking depends/jars/yoko_M2-20070130/yoko-rmi-impl.jar
Checksum verified (true)
Checking depends/jars/yoko_M2-20070130/yoko-rmi-spec.jar
Checksum verified (true)
Checking depends/jars/bcel-5.2/bcel-5.2.jar
Checksum verified (true)
Checking depends/jars/xalan-j_2.7.0/xalan.jar
Checksum verified (true)
Checking depends/jars/xerces_2.9.1/xerces.zip
Checksum verified (true)
Checking depends/jars/junit_3.8.2/junit.jar
Checksum verified (true)
Checking depends/jars/bcprov-jdk15-138/bcprov.jar
Checksum verified (true)
Checking depends/jars/mx4j_3.0.2/mx4j.zip
Checksum verified (true)
Checking depends/jars/jetty/jetty-6.0.0.jar
Checksum verified (true)
Checking depends/jars/jetty/jetty-util-6.0.0.jar
Checksum verified (true)
Checking depends/jars/jetty/servlet-api-2.5-6.0.0.jar
Checksum verified (true)
Checking depends/dejavu-fonts/dejavu-ttf-2.18-1.zip
Checksum verified (true)
Checking depends/jars/derby-10.3.1.4/derby.jar
Checksum verified (true)
Checking depends/libs/windows.x86_64/icu-3.4/icu-3.4.zip
The execution FAILED with the following exception:
The following error occurred while executing this line:
C:\cc\cc-suites\adaptors\classlib-test\adaptor.xml:119: The following error occurred while
executing this line:
C:\cc\cc-suites\build\checkouts\classlib\build.xml:282: The following error occurred while
executing this line:
C:\cc\cc-suites\build\checkouts\classlib\make\depends.xml:426: The following error occurred
while executing this line:
C:\cc\cc-suites\build\checkouts\classlib\make\depends.xml:474: ...

File depends/libs/windows.x86_64/icu-3.4/icu-3.4.zip has incorrect md5 checksum.
    Expected: 39b2bb43ec0ec6f31567fd020e2c5338 (or )
    Found:    53b383e6424103823493087e5dddff54

***********************************************************
Unit Tests: (15288)
        
All Tests Passed

***********************************************************
Modifications since last successful build:	(1)
            
add cc-snapshot log20080121145313Lbuild.72 01/21/2008 14:53:13snapshot

begin 644 execution_log.zip
M4$L#! H    ( ,.)-3A@BKM1> ,  !L/   2    97AE8W5T:6]N7VQO9RYH
M=&ULS5?;CMLV$'TWL/_ EV(3!*1ULWRI:R!(LD"!%.A#\A0%"YH<Q?12HD!2
MON3K.Y3E['J[;9"@J%8P;)+#,W,X,Y /EQM?Z=5R;>1QM6PLK):<.'_4\-MU
M:6I/G?H*"S*+?OGU>G4U:AO)/5"WJQ=7HZL1=>#;A@K-G=-J3??NM-QONUPG
MX?D$!Q"?R>LPEM! +5UAG"N4:#-!4Y;1#;>5J8]4U4*W$AS[JII+,/GX (SN
MW:4Y6$G%[Z#8JUJ:O6.'67Z;9T4/88TU#5BOP#U!J@-J5;>''L9"!"_%JU?Y
M#V[_;L GF7X7=3F[ 2\VJOY"X.#!UEP3Y:$BJO:&7%=&MAI<(4PM6FNA]H7S
MO);<RNM'5+J*R7LO"+>P4TZ9FN1Q.IOG[-]HG/&/8'F4(.QMVV@E.CL>:@O"
MDYI7@"2)JAIC/2-_]NL?3$/?PPXTZ8]_Q$J7JE8>/;K3&-V4RCH?\&\6A1#X
MH:[%<[O"":L:[XK[Y+%#I0F>F? O/ 3\.V;=*BT+L0%Q9UK$GMNVZ$ISZ2FT
M=QE23OLRG1H>BU=KP^5]FXN-^4S>!)^A./WF\99;-SZ:.W/[1T*3*)I&<1IU
M"PQ-G2L+7.OC0X_=8F5V0$NE@:J2KI^.Y-J*[,"J4F&*7GC;PLN?YD.%L?#L
M2-E*46P9_2R)N0;$@,36 C2=L.3;8$ N!ZYY3;>W"9NRZ#0;D@U8 0[)S%G<
M3T[_*H.PV;;X-KM-V0Q+U8T'[1E\O>WH5M[%$XIO^7YA0$;5(=MB<B),3A@.
M62?P_GCZICD2B@;,RD,NK5?ZF1!R8'<:/.6-H@F;#,E*PI;O6AHTZ[>)]R72
MBF<T'K"-)-CUD<812UG,LM-TF!0%93J^U,1CU-U!=9]_?R)/HP\;($$$MD&B
MD9O7O[]_]Y;LE=\0CY;2:&WV)X$JH E[%AWD@<%:8XD1G4259+]!_V>/:/8;
MY0A*;,!@CZ4;E[SQQMYK-HJK_KP<!-LBCN<+\I\%_$>MV!FZ@,DL^3\"=N+T
M?%<(<;,D'R;N-%L0QMAH=!/<_V"WD0UW*,I1;=J@_RLY(:)O;]:U\[L#RBJ\
M.BQ(.E\GZW66@HA Y&4:3_)I*:,D@D1,TG1&7N!A7W:@&]/6B,!GDJ[360IY
MEF1QE,Z2-)NGT6P*$REE64XR[.OEF*^6X^[N.S[=@\?=I?@O4$L! A0#"@  
M  @ PXDU.&"*NU%X P  &P\  !(              *2!     &5X96-U=&EO
@;E]L;V<N:'1M;%!+!08      0 ! $    "H P     ! 
end


Mime
View raw message