harmony-alerts mailing list archives

Site index · List index
Message view « Date » · « Thread »
Top « Date » · « Thread »
From nom...@intel.com
Subject [build-test alert] FAILED Windows 2003 x86: classlib-test
Date Mon, 21 Jan 2008 12:06:29 GMT
svn.revision=613602
BUILD FAILED:
	Ant Error Message:
C:\cc\cc-suites\scripts\cc-exec-adaptor.xml:104: The following error occurred while executing
this line: C:\cc\cc-suites\adaptors\classlib-test\adaptor.xml:119: The following error occurred
while executing this line: C:\cc\cc-suites\build\checkouts\classlib\build.xml:282: The following
error occurred while executing this line: C:\cc\cc-suites\build\checkouts\classlib\make\depends.xml:426:
The following error occurred while executing this line: C:\cc\cc-suites\build\checkouts\classlib\make\depends.xml:474:
...  File depends/libs/windows.x86/icu-3.4/icu-3.4.zip has incorrect md5 checksum.     Expected:
4ab256e309d1ceb9779b10cf32c79dab (or )     Found:    f8b46d05e08ca98e42738f159ae1dd40

Date of build:	2008-01-21 18:02:48 +0600
Time to build:	2 minutes 58 seconds
Last changed:	01/21/2008 16:47:14
Last log entry:	snapshot

***********************************************************
Errors/Warnings:	(32)
            
Checking depends/jars/yoko_M2-20070130/yoko.jar
Checksum verified (true)
Checking depends/jars/yoko_M2-20070130/yoko-core.jar
Checksum verified (true)
Checking depends/jars/yoko_M2-20070130/yoko-rmi-impl.jar
Checksum verified (true)
Checking depends/jars/yoko_M2-20070130/yoko-rmi-spec.jar
Checksum verified (true)
Checking depends/jars/bcel-5.2/bcel-5.2.jar
Checksum verified (true)
Checking depends/jars/xalan-j_2.7.0/xalan.jar
Checksum verified (true)
Checking depends/jars/xerces_2.9.1/xerces.zip
Checksum verified (true)
Checking depends/jars/junit_3.8.2/junit.jar
Checksum verified (true)
Checking depends/jars/bcprov-jdk15-138/bcprov.jar
Checksum verified (true)
Checking depends/jars/mx4j_3.0.2/mx4j.zip
Checksum verified (true)
Checking depends/jars/jetty/jetty-6.0.0.jar
Checksum verified (true)
Checking depends/jars/jetty/jetty-util-6.0.0.jar
Checksum verified (true)
Checking depends/jars/jetty/servlet-api-2.5-6.0.0.jar
Checksum verified (true)
Checking depends/dejavu-fonts/dejavu-ttf-2.18-1.zip
Checksum verified (true)
Checking depends/jars/derby-10.3.1.4/derby.jar
Checksum verified (true)
Checking depends/libs/windows.x86/icu-3.4/icu-3.4.zip
The execution FAILED with the following exception:
The following error occurred while executing this line:
C:\cc\cc-suites\adaptors\classlib-test\adaptor.xml:119: The following error occurred while
executing this line:
C:\cc\cc-suites\build\checkouts\classlib\build.xml:282: The following error occurred while
executing this line:
C:\cc\cc-suites\build\checkouts\classlib\make\depends.xml:426: The following error occurred
while executing this line:
C:\cc\cc-suites\build\checkouts\classlib\make\depends.xml:474: ...

File depends/libs/windows.x86/icu-3.4/icu-3.4.zip has incorrect md5 checksum.
    Expected: 4ab256e309d1ceb9779b10cf32c79dab (or )
    Found:    f8b46d05e08ca98e42738f159ae1dd40

***********************************************************
Unit Tests: (15389)
        
All Tests Passed

***********************************************************
Modifications since last successful build:	(1)
            
add cc-snapshot log20080121164714Lbuild.70 01/21/2008 16:47:14snapshot

begin 644 execution_log.zip
M4$L#! H    ( +B0-3B6=XI?>0,  !4/   2    97AE8W5T:6]N7VQO9RYH
M=&ULS5??B]LX$'X/[/^@EV-;BA3;<1(GEULH;1<.>G /[5-=%ED:U\K*EI'D
M_.A??R,GZ29[>U=:CO.:D$@:?3.?9@;GTZKRM;Y9%4;N;U:MA9L5)\[O-?QV
M79K&4Z>^PI)DT2^_7M]<C;I6<@_4;9KEU>AJ1!WXKJ5"<^>T*NC6'9:/VR[7
M27@^P0[$9_(ZC"6TT$B7&^=R);I4T E+:<5M;9H]58W0G03'OJKV$DP^GH'1
MO;LT!RNI^3WD6]5(LW5LE\WN9FE^A+#6FA:L5^">(-4#M6JZW1'&0@0OQ:M7
MLQ_<_MV 3S+]+NIR=@M>5*KY0F#GP39<$^6A)JKQAES71G8:7"Y,(SIKH?&Y
M\[R1W,KK1U3ZBLD'+PBWL%%.F8;,XDDVF[)_HW'"/X+-H@1A;[M6*]';\5!K
M$)XTO 8D253=&NL9^?.X_L&T]#UL0)/C\?=8Z5(URJ-'=QBCFU)9YP/^S3(7
M C_4=7ANESMA5>M=_I \MJLUP3,3_H6'@'_'%)W2,A<5B'O3(?;4MGE?FDM/
MH;W+D')Z+-.AX;%XC39</K2YJ,QG\B;X#,4Y;AZON77CO;DW=W\D-(FB>11/
MHGZ!H:EW98%KO3_WV"_69@.T5!JH*FGQ="37U60#5I4*4_3"VPY>_C0?*HR%
M9T?*UHIBR^AG2<RU( 8D5@C0=,J2;X,!N>RXY@U=WR5LSJ+#;$@V8 4X)+-@
M\7%R^%<9A,VZP[?9W81E6*I^/&C/X.MM0]?R/IY2?,L?%P9D5._2-28GPN2$
MX9!U N_WAV\Z0T+1@%DYY])YI9\)(0=VH\%3WBJ:L.F0K"2L^::C0;-^FWA?
M(JTXH_& ;23!%GL:1VS"8I8>IL.D*"C3\9G2'*/H#I+[]/L321I]J( $!=@%
M?49N7__^_MU;LE6^(AXMI=':; _J5$ ;]BQ[R)G!6F.)$;T^E61;H?^31S3[
M2CF"^AHPV&/=QB5OO;$/@HWBJC\M![6VC./%DOQG ?]1*/:&/F"2)?]'P%Z9
MGBX*(6Z:S(:).T^7A#$V&MT&]S_2:J3B#N4XZDP;E'\MIT0<&YOUC?QNAX(*
M+PU+DO(BF<Y@$BUD+*!8S.>+(HY$.4G$?"%Y05[@25_VH%O3-8C I\R*=":C
M*429X(L,TF0^R<IXNN 02YE&V-2K,;]9C?M;[_AP Q[WU^&_ %!+ 0(4 PH 
M   ( +B0-3B6=XI?>0,  !4/   2              "D@0    !E>&5C=71I
A;VY?;&]G+FAT;6Q02P4&      $  0!     J0,      
end


Mime
View raw message