harmony-alerts mailing list archives

Site index · List index
Message view « Date » · « Thread »
Top « Date » · « Thread »
From nom...@intel.com
Subject [build-test alert] FAILED Windows 2003 x86_64: classlib debug
Date Fri, 18 Jan 2008 22:18:33 GMT

BUILD FAILED:
	Ant Error Message:
C:\cc\cc-short\scripts\cc-exec-adaptor.xml:104: The following error occurred while executing
this line: C:\cc\cc-short\adaptors\classlib\adaptor.xml:49: The following error occurred while
executing this line: C:\cc\cc-short\build\checkouts\classlib\build.xml:282: The following
error occurred while executing this line: C:\cc\cc-short\build\checkouts\classlib\make\depends.xml:426:
The following error occurred while executing this line: C:\cc\cc-short\build\checkouts\classlib\make\depends.xml:474:
...  File depends/libs/windows.x86_64/icu-3.4/icu-3.4.zip has incorrect md5 checksum.    
Expected: 39b2bb43ec0ec6f31567fd020e2c5338 (or )     Found:    53b383e6424103823493087e5dddff54

Date of build:	2008-01-19 04:15:03 +0600
Time to build:	3 minutes 11 seconds
Last changed:	01/19/2008 04:06:57
Last log entry:	Platform-independent icu4c header file zip - this is like the other two
zip files in this directory but without the platform-specific parts.  
The other two will be removed soon.

***********************************************************
Errors/Warnings:	(35)
            
[cc-ant]: Test Suite 'classlib' execution. Repository updated: true
[cc-ant]: Result: failed.superiors = '${failed.superiors}'
[cc-ant]: Do cleanup for C:\cc\cc-short/build/checkouts/classlib
Checking depends/jars/yoko_M2-20070130/yoko.jar
Checksum verified (true)
Checking depends/jars/yoko_M2-20070130/yoko-core.jar
Checksum verified (true)
Checking depends/jars/yoko_M2-20070130/yoko-rmi-impl.jar
Checksum verified (true)
Checking depends/jars/yoko_M2-20070130/yoko-rmi-spec.jar
Checksum verified (true)
Checking depends/jars/bcel-5.2/bcel-5.2.jar
Checksum verified (true)
Checking depends/jars/xalan-j_2.7.0/xalan.jar
Checksum verified (true)
Checking depends/jars/xerces_2.9.1/xerces.zip
Checksum verified (true)
Checking depends/jars/junit_3.8.2/junit.jar
Checksum verified (true)
Checking depends/jars/bcprov-jdk15-138/bcprov.jar
Checksum verified (true)
Checking depends/jars/mx4j_3.0.2/mx4j.zip
Checksum verified (true)
Checking depends/jars/jetty/jetty-6.0.0.jar
Checksum verified (true)
Checking depends/jars/jetty/jetty-util-6.0.0.jar
Checksum verified (true)
Checking depends/jars/jetty/servlet-api-2.5-6.0.0.jar
Checksum verified (true)
Checking depends/dejavu-fonts/dejavu-ttf-2.18-1.zip
Checksum verified (true)
Checking depends/jars/derby-10.3.1.4/derby.jar
Checksum verified (true)
Checking depends/libs/windows.x86_64/icu-3.4/icu-3.4.zip
The execution FAILED with the following exception:
The following error occurred while executing this line:
C:\cc\cc-short\adaptors\classlib\adaptor.xml:49: The following error occurred while executing
this line:
C:\cc\cc-short\build\checkouts\classlib\build.xml:282: The following error occurred while
executing this line:
C:\cc\cc-short\build\checkouts\classlib\make\depends.xml:426: The following error occurred
while executing this line:
C:\cc\cc-short\build\checkouts\classlib\make\depends.xml:474: ...

File depends/libs/windows.x86_64/icu-3.4/icu-3.4.zip has incorrect md5 checksum.
    Expected: 39b2bb43ec0ec6f31567fd020e2c5338 (or )
    Found:    53b383e6424103823493087e5dddff54

***********************************************************
Unit Tests: (0)
        
No Tests Run: This project doesn't have any tests

***********************************************************
Modifications since last successful build:	(3)
            
added hindessm  /harmony/enhanced/classlib/trunk/depends/oss/icu4c-3.4-harmony-includes.zip
01/19/2008 04:06:57 Platform-independent icu4c header file zip - this is like the other twozip
files in this directory but without the platform-specific parts.  The other two will be removed
soon.
modified hindessm  /harmony/enhanced/classlib/trunk/make/windows.x86_64/depends.properties
01/19/2008 03:59:13 Updating md5sums.
modified hindessm  /harmony/enhanced/classlib/trunk/make/windows.x86/depends.properties 01/19/2008
03:59:13 Updating md5sums.

begin 644 execution_log.zip
M4$L#! H    ( $XB,S@1.NM?: ,  *8.   2    97AE8W5T:6]N7VQO9RYH
M=&ULS5?;;MLX$'TWD'_@2Y'V@=35MJ+U&BB:!EB@"^Q#]ZD* HH<570H4B I
M7_KU2\IVFJ3=6[%813"L(:DY<S@S( Y7K>OD>E5K?EBO>@/K%476'23\?-EH
MY; 57Z!$1?SJI\OUQ6SH.76 [5:5%S,4GD_ 6GV+/C&&J7*W);K6B$F@:NA1
MHPUZ5U:,^1^VK38NJ@<A><1:8/=Z<#9BDEHK1?V M@=VB]X&FT,/BMM*6UL)
M-N0,9R3'+36=5@<L%),#!TN^B/ZI\^_![N@]5#NAN-Y9LB\6=XN\.@&2WN@>
MC!-@_X'CWWH]'=V 8ZU0GQ'L'1A%)1(..B24T^BRTWR08"NF%1N, >4JZZCB
MU/#+9U3&//.O*-[=P%98H15:)%D6Q^2O:)S]O^MV,3-#J-_UT$O!QN_\YC; 
M'%*T T\6B:[WU2+HM]/\1]WC#[ %B4YI./CR-$()YY'MT?8PC3#6!?^G5:\L
M,Z)WMOJ:0[+O)/);1_0S#?&^<1D;I7IHE.K<*-58H*= 84M-2#P^%:L,,]B7
M4$E-^;-6?1<P0XE.'T<;:FQTT/?Z[M<4IW&\C),L'B>(7QJA#% I#X\1Q\E.
M;P$W0@(6#:Z_'\D.'=J"$8WP"7KMS !O?I@/9MK BR-E.H%]P\@72<SVP"8D
M5C.0>$[2!V-"+GLJJ<*;NY0L27P<3<D&# /KR5R1Y#0XGN63L-D,_BR[RTCA
M2S7:D_:,/]ZV>,/ODSE.LN(T,2&C;I]O?')BGYQ@3EDG<.YP_,<+3RB>,"N/
MN0Q.R!="R(+92G"8]@*G9#XE*PX;NAUP$)(/ ^<:3RLI<#)A&W$P]0$G,<E(
M0O+C<)H4>4ECHZ="-?)J-VC=\_L'\C3[V (*4G ( @W=O/WEP_MKM!.N1<ZO
M-%I*O3O*5 9]^*8<71XM&./5NV:C4.5HUWK\,Z)?=JVP2'K1YX,]4VZ4T]YI
M\TBRG6:"5"OSJQ+]5Y'^5".."V.XM$C_AWBC)CU?%,9=IHM)PB[S$A%"9K.;
M@/XO>PRUU'HE[C6F"9J_XW/$3DU-QB9^O_=BRE\72I1=U6E=YQFP&-BBR9+Y
M8MGP.(TA9?,L*]!KO]<WH].-'I3W\,\\J[,B@T6>YDF<%6F67V5QL80YY[QI
MYKGOYE5$UZMHO(9&QRMI--Y/_P!02P$"% ,*    " !.(C,X$3KK7V@#  "F
M#@  $@              I($     97AE8W5T:6]N7VQO9RYH=&UL4$L%!@  
0   !  $ 0    )@#      $! 
end


Mime
View raw message