harmony-alerts mailing list archives

Site index · List index
Message view « Date » · « Thread »
Top « Date » · « Thread »
From nom...@intel.com
Subject [build-test alert] FAILED Windows 2003 x86: hdk debug
Date Fri, 18 Jan 2008 22:14:12 GMT

BUILD FAILED:
	Ant Error Message:
D:\cc\cc-common\scripts\cc-exec-adaptor.xml:104: The following error occurred while executing
this line: D:\cc\cc-common\adaptors\hdk\adaptor.xml:48: The following error occurred while
executing this line: D:\cc\cc-common\scripts\framework.xml:1070: Java returned: 1

Date of build:	2008-01-19 04:10:04 +0600
Time to build:	3 minutes 26 seconds
Last changed:	01/19/2008 04:06:57
Last log entry:	Platform-independent icu4c header file zip - this is like the other two
zip files in this directory but without the platform-specific parts.  
The other two will be removed soon.

***********************************************************
Errors/Warnings:	(14)
            
[cc-ant]: Test Suite 'hdk' execution. Repository updated: true
[cc-ant]: Result: failed.superiors = '${failed.superiors}'
[hdk]: Updating HDK workspace to revision: HEAD
BUILD FAILED
D:\cc\cc-common\build\checkouts\hdk\build.xml:334: The following error occurred while executing
this line:
D:\cc\cc-common\build\checkouts\hdk\build.xml:344: The following error occurred while executing
this line:
D:\cc\cc-common\build\checkouts\hdk\working_classlib\build.xml:282: The following error occurred
while executing this line:
D:\cc\cc-common\build\checkouts\hdk\working_classlib\make\depends.xml:426: The following error
occurred while executing this line:
D:\cc\cc-common\build\checkouts\hdk\working_classlib\make\depends.xml:474: ...
File depends/libs/windows.x86/icu-3.4/icu-3.4.zip has incorrect md5 checksum.
Expected: 4ab256e309d1ceb9779b10cf32c79dab (or )
Found:    f8b46d05e08ca98e42738f159ae1dd40
Total time: 3 minutes 18 seconds
The execution FAILED with the following exception:
The following error occurred while executing this line:
D:\cc\cc-common\adaptors\hdk\adaptor.xml:48: The following error occurred while executing
this line:
D:\cc\cc-common\scripts\framework.xml:1070: Java returned: 1

***********************************************************
Unit Tests: (0)
        
No Tests Run: This project doesn't have any tests

***********************************************************
Modifications since last successful build:	(3)
            
added hindessm  /harmony/enhanced/classlib/trunk/depends/oss/icu4c-3.4-harmony-includes.zip
01/19/2008 04:06:57 Platform-independent icu4c header file zip - this is like the other twozip
files in this directory but without the platform-specific parts.  The other two will be removed
soon.
modified hindessm  /harmony/enhanced/classlib/trunk/make/windows.x86_64/depends.properties
01/19/2008 03:59:13 Updating md5sums.
modified hindessm  /harmony/enhanced/classlib/trunk/make/windows.x86/depends.properties 01/19/2008
03:59:13 Updating md5sums.

begin 644 execution_log.zip
M4$L#! H    ( ,,A,SCJ%F$@]@0   D;   2    97AE8W5T:6]N7VQO9RYH
M=&ULW5E+<]LV$+YKQO\!ET[2 ]]ZLHYGG"B>I$UZ:!X]1!X-!"Q-6"3! 4 ]
M\NN[("7'5BR93CII(XYL @2PV&^_W04!GJ8FS\Y.9Y*OSTY+!6>GE&BSSN#9
MDT06QM'B,\1DZ/_RVY.SDTY5<FK T8LB/NF<=%1E[\1>GX"E\I)\2OG\,B8?
M;#]17)%7XS_(4JJY+BD#8B11L!!:R"(FKUZ>CV\&KX!=DG-STTSZ012.1NZV
MPS5=T$ORO!(93T2&&LULT5WEV=T>=VNHIU,J6<:'.HE"F(,=="J74RM&[W2[
M#7Q_RSW7.5HC!?**JEP6:W(!'!3:E3< VXEZUOIJ)P]M9:W_Y4%,-B2T&R]+
MB\%RKM?:0&['+T7!Y5*W$T 52X4!9BH%6P56P[X3A2W'%X9(30J:@V=EV?%_
M-PJ0T/<C#X6UDY1*70/Y'7MM-0G<GNM/ Y\\?5<5Y*U@2C8X-7E=,/?7=I)K
MKR6YY/#%R!QFU55+&U>FK S))$-+8Y#8X8:J*S#MQH__>O/Q+6$9U3H3LV9Z
MU_6:GPU31#W=-K<3^>[CGT1):6X>H,C4&(P5ST.7<FGMZJY45YZ"4FJ/ZN1A
MR0?#$4RU&]&VQ"$# Y=D;.^6/BX4>I-4:S*.)XSASV$RQXB;U#1,4"\V1Y/J
M"2:MR3X[?LKG*.B2O%!0ARA6XF\6N(-D*0Q+IVBFZ2*_/[>TRXM[Q6ZY/"3<
MECF44' ]D5I/!*NZS(G<KI,V^<D1!<LJ#MK]+,K]@C[8<D[G,-F$O8L!-^UW
M)QOAKDVAH(R ^Q/"?B&/DU O4?SV6O-(HUWSN9$RVY/MOY>1VF$4:%DI!O_B
M'*4LJPR13QO)!U<T6ADY3<#JM/60*?[M:G.W]G#_]VIMXPXM+Q>@E, L)S'=
M<4CL&FMQR 3SE9X3ELYUE3\XF[,A_J!>#KI)D4G*#ZS.+VQDUCFA$>A=4Z6]
MM9S+Z=O0P=5AX >17S]PL>G@=)@'LFR];]:O.N=H"\>^LS@B<68/:XEV(6@]
MD0ATXJ=&57!@;7D$+DQ5"HX6G,J%(_(R.VJ N@1V! !G##*GYX8WA2/ M*(9
M+9SK:>@.7+^I'0,JL&L4@AJYP:;R]3O 3X?JNL+5:!JY0W3!NGP$3,T8OALM
M''QU"7I.$ TW#XX 6;[J7B-9/I)EB\?@?V#,NOGO]!&8?P0LW<94&9$=&3 -
M:H&[2H>6P@G=WC&@XX"=*L<>\MU4C$D07C!T@B,(,PYJMG8"WXW<P.TVU9^;
M,KOE\F[MBSW<JMN-^O;^@TF[6WO^X?6;,;DX?_WFY?AN2YO#DIOCW#B*NC%Y
MGP))9);)I<6/>TFIB&2L4@KMMDQ1)6(WR55]SF-2H4DFBMT][R/G[?[(>7</
MVVXI$@[#_U*1^O!E>^!B]>F&_?^7/@,DRG4/'H9<6(4>$S8DI9J( O?(]LR0
MY+Q'V"9@W:\C].4*=V(&>$RZ=!;V^A#Y(QXPF(T&@]$L\%D2A6PPXG1&GJ*A
M[HGQ"UD5.!RO9#CK]KG? W_(Z&@(W7 0#9.@-Z(0<-[U#\%\+PW-B!$YQ"0B
MN2@J YH$0Z*!281^TNE8XC;,R&(3GF0I3(HLW:%TQ:"T?>+.-W.]RR_EM#12
M-<1N*@V%P^_PJ-U9-%.B1.])%,W!ND\]18";Y[@YP5=@*E58MH+.2>?4HV>G
M7OVERVN^>GGU)[!_ %!+ 0(4 PH    ( ,,A,SCJ%F$@]@0   D;   2    
M          "D@0    !E>&5C=71I;VY?;&]G+FAT;6Q02P4&      $  0! 
)    )@4      
end


Mime
View raw message