harmony-alerts mailing list archives

Site index · List index
Message view « Date » · « Thread »
Top « Date » · « Thread »
From nom...@intel.com
Subject [build-test alert] FAILED Windows 2003 x86: classlib debug
Date Fri, 18 Jan 2008 22:11:34 GMT

BUILD FAILED:
	Ant Error Message:
C:\cc\cc-short\scripts\cc-exec-adaptor.xml:104: The following error occurred while executing
this line: C:\cc\cc-short\adaptors\classlib\adaptor.xml:28: The following error occurred while
executing this line: C:\cc\cc-short\build\checkouts\classlib\build.xml:282: The following
error occurred while executing this line: C:\cc\cc-short\build\checkouts\classlib\make\depends.xml:426:
The following error occurred while executing this line: C:\cc\cc-short\build\checkouts\classlib\make\depends.xml:474:
...  File depends/libs/windows.x86/icu-3.4/icu-3.4.zip has incorrect md5 checksum.     Expected:
4ab256e309d1ceb9779b10cf32c79dab (or )     Found:    f8b46d05e08ca98e42738f159ae1dd40

Date of build:	2008-01-19 04:08:30 +0600
Time to build:	2 minutes 30 seconds
Last changed:	01/19/2008 04:06:57
Last log entry:	Platform-independent icu4c header file zip - this is like the other two
zip files in this directory but without the platform-specific parts.  
The other two will be removed soon.

***********************************************************
Errors/Warnings:	(32)
            
Checking depends/jars/yoko_M2-20070130/yoko.jar
Checksum verified (true)
Checking depends/jars/yoko_M2-20070130/yoko-core.jar
Checksum verified (true)
Checking depends/jars/yoko_M2-20070130/yoko-rmi-impl.jar
Checksum verified (true)
Checking depends/jars/yoko_M2-20070130/yoko-rmi-spec.jar
Checksum verified (true)
Checking depends/jars/bcel-5.2/bcel-5.2.jar
Checksum verified (true)
Checking depends/jars/xalan-j_2.7.0/xalan.jar
Checksum verified (true)
Checking depends/jars/xerces_2.9.1/xerces.zip
Checksum verified (true)
Checking depends/jars/junit_3.8.2/junit.jar
Checksum verified (true)
Checking depends/jars/bcprov-jdk15-138/bcprov.jar
Checksum verified (true)
Checking depends/jars/mx4j_3.0.2/mx4j.zip
Checksum verified (true)
Checking depends/jars/jetty/jetty-6.0.0.jar
Checksum verified (true)
Checking depends/jars/jetty/jetty-util-6.0.0.jar
Checksum verified (true)
Checking depends/jars/jetty/servlet-api-2.5-6.0.0.jar
Checksum verified (true)
Checking depends/dejavu-fonts/dejavu-ttf-2.18-1.zip
Checksum verified (true)
Checking depends/jars/derby-10.3.1.4/derby.jar
Checksum verified (true)
Checking depends/libs/windows.x86/icu-3.4/icu-3.4.zip
The execution FAILED with the following exception:
The following error occurred while executing this line:
C:\cc\cc-short\adaptors\classlib\adaptor.xml:28: The following error occurred while executing
this line:
C:\cc\cc-short\build\checkouts\classlib\build.xml:282: The following error occurred while
executing this line:
C:\cc\cc-short\build\checkouts\classlib\make\depends.xml:426: The following error occurred
while executing this line:
C:\cc\cc-short\build\checkouts\classlib\make\depends.xml:474: ...

File depends/libs/windows.x86/icu-3.4/icu-3.4.zip has incorrect md5 checksum.
    Expected: 4ab256e309d1ceb9779b10cf32c79dab (or )
    Found:    f8b46d05e08ca98e42738f159ae1dd40

***********************************************************
Unit Tests: (0)
        
No Tests Run: This project doesn't have any tests

***********************************************************
Modifications since last successful build:	(3)
            
added hindessm  /harmony/enhanced/classlib/trunk/depends/oss/icu4c-3.4-harmony-includes.zip
01/19/2008 04:06:57 Platform-independent icu4c header file zip - this is like the other twozip
files in this directory but without the platform-specific parts.  The other two will be removed
soon.
modified hindessm  /harmony/enhanced/classlib/trunk/make/windows.x86_64/depends.properties
01/19/2008 03:59:13 Updating md5sums.
modified hindessm  /harmony/enhanced/classlib/trunk/make/windows.x86/depends.properties 01/19/2008
03:59:13 Updating md5sums.

begin 644 execution_log.zip
M4$L#! H    ( &\A,SBBV_T91 ,  %(.   2    97AE8W5T:6]N7VQO9RYH
M=&ULS5?;CMLV$'TWL/_ EV"3!U(7R[;LN@:") L42($^I$]UL*#(440O)0HD
MY4N^/D-9SEZ2WH*B6L&PAJ3.S.',@#A<5[[6FW5AY&FS;BULUIPX?]+P\W5I
M&D^=^@PKDL<O?KK>7$VZ5G(/U.V;U=6$A.</.(+X2%X'6T(+C721<2Y2HLL$
MG;*,5MS6ICE1U0C=27#LLVH?@W\/=LWO(#JH1IJ#8\=\?CO/HL$A:ZUIP7H%
M[A\ _Q;U>'0#7E2J^43@Z,$V7!/EH2:J\89<UT9V&EPD3",Z:Z'QD?.\D=S*
MZR=4^LS(>R\(M[!73IF&S)-INERROZ)QP7\7=C6Q7<CXVZ[52O3?X>9V(#QI
M> U(EJBZ-=8S\MLP_\&T]#WL09,A#2<L3ZD:Y=&S.]OHIE36^8!_L]H*@3_J
M*O2S=<*JUKOM?0[9L=8$MT[X)Q[B?0,I.J7E5E0@[DR'4*&Y<UH5VU"@)X["
MELJ0>#H4:Q5F*):PT8;+^^82E?E(W@2?H427!MMQZZ*3N3.WOZ8TC>-%G$SC
M?H+A4N_* M?Z]-!C/UF;/=!2::"JI,7W([FN)GNPJE28H)?>=O#JA_E082P\
M.U*V5A0;1C]+8JX%,2*Q0H"F,Y9^-4;D<N2:-W1WF[(%B\^C,=F %>"0S)(E
MP^!\EH_"9M?A678[93F6JK='[1D\WO9T)^^2&4VF^3 Q(J/ZF.TP.3$F)YAC
MU@F\/YW_Z1P)Q2-FY2&7SBO]3 @YL'L-GO)6T93-QF0E8<?W'0W2[^O ^Q)I
M)3E-1FPC";8XT21F4Y:P[#P<)T4H:=PCO8E2-PC=R_L'DC3Y4 $).K +ZHS<
MO/[E_;NWY*!\13RNE$9K<SAK5 %M^&;50QXL6&LL,:)7J9(<*O1_\8C+OE*.
M:%1\&.R);..2M][8!WIMF DZ;97F*_)?1?I3@=@O#.'2_R%>+T@OMX00-DOG
MHX1=9"O"&)M,;H+W?]-@I.(.-3BJ2QO4?BUG1 SMS/KV?7=$&847A17)>)'.
MYC"-ES(14"P7BV61Q**<IF*QE+P@+W&CKWK0C>D:1.!3YD4VE_$,XESP90Y9
MNICF93);<DBDS&)LY77$-^NHOS)&Y^MCU-\EOP!02P$"% ,*    " !O(3,X
MHMO]&40#  !2#@  $@              I($     97AE8W5T:6]N7VQO9RYH
9=&UL4$L%!@     !  $ 0    '0#      $! 
end


Mime
View raw message