harmony-alerts mailing list archives

Site index · List index
Message view « Date » · « Thread »
Top « Date » · « Thread »
From nom...@intel.com
Subject [build-test alert] FAILED Windows 2003 x86: drlvm-reg-test
Date Fri, 18 Jan 2008 09:36:09 GMT
svn.revision=612947
BUILD FAILED:
	Ant Error Message:
C:\cc\cc-suites\scripts\cc-exec-adaptor.xml:104: The following error occurred while executing
this line: C:\cc\cc-suites\adaptors\drlvm-reg-test\adaptor.xml:97: exec returned: 1

Date of build:	2008-01-18 15:35:16 +0600
Time to build:	43 seconds
Last changed:	01/18/2008 14:37:21
Last log entry:	snapshot

***********************************************************
Errors/Warnings:	(3)
            
svn: PROPFIND request failed on '/repos/asf/harmony/enhanced/drlvm/trunk'
svn: PROPFIND of '/repos/asf/harmony/enhanced/drlvm/trunk': could not connect to server (https://svn.apache.org)
The execution FAILED with the following exception:
The following error occurred while executing this line:
C:\cc\cc-suites\adaptors\drlvm-reg-test\adaptor.xml:97: exec returned: 1

***********************************************************
Unit Tests: (352)
        
All Tests Passed

***********************************************************
Modifications since last successful build:	(1)
            
add cc-snapshot log20080118143721Lbuild.69 01/18/2008 14:37:21snapshot

begin 644 execution_log.zip
M4$L#! H    ( (!\,CA<N/2^-0$  .P!   2    97AE8W5T:6]N7VQO9RYH
M=&ULC5%-3\,P#+U7ZG_P!0T.7> $A%(),29-0C A;HQ#2-RE(DV*X^Z#7T_:
M:1(G1)2#XV<_Q^^5EEM7E1_![*NR(ZQ*!9'W#F\G=?!<Q.8;)5R=G]Q,JCSK
M.Z,8B[CQ,L_RK#B\4PS#><,=ZG<84%B^/"_GBZ<9$'[U&!EJU3@T$#Q,!&$7
MHE"Q%E91&_Q>H+?*:S3"D-NT@JGWGY._:$/]?QX).O3.@ ^<(N]1,W" B+1!
M@E/+W$4I1!HP59W2%J>!UF=YEKU:A&%XSTWZ]_QN\?@P@VW#%C@A=7 N;!N_
M3C4:NZ%&CBV_ *) $+3NB=+R6YLT.#(FF&T3P35^4/!>KK1.MXA]PQA7RJB.
M \75N$E!N"Y2FH_YZ:YU\OI2CFQ)9.[)HY%PD6PIA:I*,9HI#L:*T>4?4$L!
M A0#"@    @ @'PR.%RX]+XU 0  [ $  !(              *2!     &5X
F96-U=&EO;E]L;V<N:'1M;%!+!08      0 ! $    !E 0     ! 
end


Mime
View raw message