harmony-alerts mailing list archives

Site index · List index
Message view « Date » · « Thread »
Top « Date » · « Thread »
From nom...@intel.com
Subject [build-test alert] FAILED Windows 2003 x86: JettyScenario
Date Thu, 17 Jan 2008 14:23:03 GMT
Jetty server JRE:

Apache Harmony Launcher : (c) Copyright 1991, 2007 The Apache Software Foundation or its licensors,
as applicable.
java version "1.5.0" 
pre-alpha : not complete or compatible
svn = r612140, (Jan 16 2008), Windows/ia32/msvc 1310, release build
http://harmony.apache.org


Scenario framework JRE:

Apache Harmony Launcher : (c) Copyright 1991, 2007 The Apache Software Foundation or its licensors,
as applicable.
java version "1.5.0" 
pre-alpha : not complete or compatible
svn = r612140, (Jan 16 2008), Windows/ia32/msvc 1310, release build
http://harmony.apache.org


================================================================================
Scenario results:

Testsuite: org.apache.harmony.test.jetty.JettyScenario
Tests run: 5, Failures: 0, Errors: 0, Time elapsed: 4.891 sec
------------- Standard Output ---------------
Setup completed.

==============================================================testInitialPage===
Starting initial page test case.
Loading page from server: http://localhost:7070/test/
Getting resource with name: initial_page.html
Found resource: C:\cc\cc-suites\build\checkouts\JettyScenario/resources\JettyScenario\initial_page.html
Saving content of downloaded page to: C:\cc\cc-suites\build\results\JettyScenario\JettyScenario\initial_page.html
Comparing page content with etalon: initial_page.html
Page is equal to etalon.
Initial page test case passed.

============================================================testStaticContent===
Starting static content page test case.
Loading page from server: http://localhost:7070/test/data.txt
Getting resource with name: static_content.txt
Found resource: C:\cc\cc-suites\build\checkouts\JettyScenario/resources\JettyScenario\static_content.txt
Saving content of downloaded page to: C:\cc\cc-suites\build\results\JettyScenario\JettyScenario\static_content.txt
Comparing page content with etalon: static_content.txt
Page is equal to etalon.
Static content page test case passed.

=======================================================testSessionDumpServlet===
Starting servlet test case.
Loading page from server: http://localhost:7070/test/session/
Getting resource with name: session_dump.html
Found resource: C:\cc\cc-suites\build\checkouts\JettyScenario/resources\JettyScenario\session_dump.html
Saving content of downloaded page to: C:\cc\cc-suites\build\results\JettyScenario\JettyScenario\session_dump.html
Comparing page content with etalon: session_dump.html
Page is equal to etalon.
Session dump servlet page is OK.
Getting resource with name: session_dump_new.html
Found resource: C:\cc\cc-suites\build\checkouts\JettyScenario/resources\JettyScenario\session_dump_new.html
Saving content of downloaded page to: C:\cc\cc-suites\build\results\JettyScenario\JettyScenario\session_dump_new.html
Comparing page content with etalon: session_dump_new.html
Page is equal to etalon.
Session create page is OK.
Getting resource with name: session_dump_set.html
Found resource: C:\cc\cc-suites\build\checkouts\JettyScenario/resources\JettyScenario\session_dump_set.html
Saving content of downloaded page to: C:\cc\cc-suites\build\results\JettyScenario\JettyScenario\session_dump_set.html
Comparing page content with etalon: session_dump_set.html
Page is equal to etalon.
Session set page is OK.
Getting resource with name: session_dump_remove.html
Found resource: C:\cc\cc-suites\build\checkouts\JettyScenario/resources\JettyScenario\session_dump_remove.html
Saving content of downloaded page to: C:\cc\cc-suites\build\results\JettyScenario\JettyScenario\session_dump_remove.html
Comparing page content with etalon: session_dump_remove.html
Page is equal to etalon.
Session remove page is OK.
Getting resource with name: session_dump_invalidate.html
Found resource: C:\cc\cc-suites\build\checkouts\JettyScenario/resources\JettyScenario\session_dump_invalidate.html
Saving content of downloaded page to: C:\cc\cc-suites\build\results\JettyScenario\JettyScenario\session_dump_invalidate.html
Comparing page content with etalon: session_dump_invalidate.html
Page is equal to etalon.
Session invalidate page is OK.
Servlet test case passed.

===========================================================testRequestDumpJSP===
Starting JSP test case.
Loading page from server: http://localhost:7070/test/snoop.jsp
Getting resource with name: request_dump_JSP.html
Found resource: C:\cc\cc-suites\build\checkouts\JettyScenario/resources\JettyScenario\request_dump_JSP.html
Saving content of downloaded page to: C:\cc\cc-suites\build\results\JettyScenario\JettyScenario\request_dump_JSP.html
Comparing page content with etalon: request_dump_JSP.html
Page is equal to etalon.
JSP test case passed.

=====================================================testGZippedStaticContent===
Starting gzipped static content test case.
Loading page from server: http://localhost:7070/test/data.txt.gz
Unpacking content from archive.
Getting resource with name: static_content_ungzipped.txt
Found resource: C:\cc\cc-suites\build\checkouts\JettyScenario/resources\JettyScenario\static_content_ungzipped.txt
Saving content of downloaded page to: C:\cc\cc-suites\build\results\JettyScenario\JettyScenario\static_content_ungzipped.txt
Comparing page content with etalon: static_content_ungzipped.txt
Page is equal to etalon.
Gzipped static content test case passed.
------------- ---------------- ---------------

Testcase: testInitialPage took 1.516 sec
Testcase: testStaticContent took 0.281 sec
Testcase: testSessionDumpServlet took 0.437 sec
Testcase: testRequestDumpJSP took 1.782 sec
Testcase: testGZippedStaticContent took 0.734 sec

================================================================================
Jetty server output:

2008-01-17 12:03:32.135::INFO:  Logging to STDERR via org.mortbay.log.StdErrLog
2008-01-17 12:03:32.557::INFO:  Statistics on = false for SelectChannelConnector @ 0.0.0.0:7070
2008-01-17 12:03:32.650::INFO:  jetty-6.1.2rc1
2008-01-17 12:03:32.760::INFO:  Deploy C:\cc\cc-suites\build\libs\jetty-6.1.2rc1\contexts\javadoc.xml
-> org.mortbay.jetty.servlet.Context@c4bfa0{/javadoc,file:/C:/cc/cc-suites/build/libs/jetty-6.1.2rc1/javadoc/}
2008-01-17 12:03:32.869::INFO:  Deploy C:\cc\cc-suites\build\libs\jetty-6.1.2rc1\contexts\test.xml
-> org.mortbay.jetty.webapp.WebAppContext@c6457d{/test,C:\cc\cc-suites\build\libs\jetty-6.1.2rc1/webapps/test}
2008-01-17 12:03:36.416::WARN:  Unknown realm: Test JAAS Realm
2008-01-17 12:03:38.759::INFO:  Started SelectChannelConnector @ 0.0.0.0:7070

================================================================================

BUILD FAILED:
	Ant Error Message:
C:\cc\cc-suites\scripts\cc-exec-adaptor.xml:104: exec returned: 1

Date of build:	2008-01-17 20:21:54 +0600
Time to build:	1 minute 2 seconds
Last changed:	01/17/2008 15:43:36
Last log entry:	snapshot

***********************************************************
Errors/Warnings:	(3)
            
svn: PROPFIND request failed on '/repos/asf/harmony/enhanced/buildtest/branches/2.0/tests/JettyScenario'
svn: PROPFIND of '/repos/asf/harmony/enhanced/buildtest/branches/2.0/tests/JettyScenario':
504 Gateway Time-out (http://svn.apache.org)
The execution FAILED with the following exception:
exec returned: 1

***********************************************************
Unit Tests: (5)
        
All Tests Passed

***********************************************************
Modifications since last successful build:	(1)
            
add cc-snapshot log20080117154336Lbuild.68 01/17/2008 15:43:36snapshot

begin 644 execution_log.zip
M4$L#! H    ( ."B,3C015!4!0$  *4!   2    97AE8W5T:6]N7VQO9RYH
M=&ULK5'!3H1 #+U/PC_T8M #%(TF!I'$9%VSQNAFW9OQ,$#9F01F<*:(^/4.
MZ]V3/;Z^]O7U%8K[KBPJV\QE,3@J"PF>YXYNX]8:3KS^IARNLY.;N(S$.#22
M*?&?)H\$+/5&7U2_PX+ =O>R76^>5^#H8R3/T$K=40/60(R.!NM1^A:5=+TU
M,Y)1TM348#7JKN$P@)4+B"*/%VF&"^+QD9CGUYJ,=-K&?ZG:]M]D<KC*+N$A
M>)WD#'O=4V)'AE/%/.2(03>5@PPK4NL.9Y$0>T6PW#2R#F[7=YNG^Q5,FA5P
MZ+2VZ^RDS2%P:AH63BX6>O@4C\Y0D\.YB$2!LBSPF +^)H+'>'X 4$L! A0#
M"@    @ X*(Q.-!%4%0% 0  I0$  !(              *2!     &5X96-U
C=&EO;E]L;V<N:'1M;%!+!08      0 ! $     U 0     ! 
end


Mime
View raw message