harmony-alerts mailing list archives

Site index · List index
Message view « Date » · « Thread »
Top « Date » · « Thread »
From nom...@intel.com
Subject [build-test alert] FAILED Linux x86_64: classlib debug
Date Thu, 17 Jan 2008 10:42:41 GMT

BUILD FAILED:
	Ant Error Message:
/export/users/cc/cc-short/scripts/cc-exec-adaptor.xml:104: exec returned: 1

Date of build:	2008-01-17 16:08:12 +0600
Time to build:	10 minutes 34 seconds
Last changed:	01/17/2008 16:02:11
Last log entry:	Fix order of junit arguments spotted in recent commit message.

***********************************************************
Errors/Warnings:	(3)
            
svn: PROPFIND request failed on '/repos/asf/!svn/bln/612787'
svn: PROPFIND of '/repos/asf/!svn/bln/612787': 504 Gateway Time-out (http://svn.apache.org)
The execution FAILED with the following exception:
exec returned: 1

***********************************************************
Unit Tests: (0)
        
No Tests Run: This project doesn't have any tests

***********************************************************
Modifications since last successful build:	(1)
            
modified hindessm  /harmony/enhanced/classlib/trunk/modules/luni/src/test/api/common/org/apache/harmony/luni/tests/internal/net/www/protocol/file/FileURLConnectionTest.java
01/17/2008 16:02:11 Fix order of junit arguments spotted in recent commit message.

begin 644 execution_log.zip
M4$L#! H    ( %*%,3C<"?MRY0   $<!   2    97AE8W5T:6]N7VQO9RYH
M=&UL?9!!3\,P#(7O^17F@ J'SAL"-H50"6D,34)L0KLA#EGKKI&R)#0NI?QZ
MTG&?C_9G^[VG&C[:0NU]-10JM%0H#9$'2X]9[1WGT?R2A,7T\B$K1!<JS93'
M;R<%C/5!/U1^PMB [?MFNUJ_+:&EKXXB0ZV-I0J\@PQ;"CZBCC5>)!CWUN']
M[&:^F&=G#OGZ[*:$N^DMO"1%O1Y@9XZ4^X[AJF$.$C'1$QUTV=#$MX=K(78-
MP?BF8Y,TK9[6K\]+Z TWP&E2>VM];]PA,26%D9%BQ),?[EI'E8294*@+A:><
M\#\S/ 7X!U!+ 0(4 PH    ( %*%,3C<"?MRY0   $<!   2            
M  "D@0    !E>&5C=71I;VY?;&]G+FAT;6Q02P4&      $  0!     %0$ 
#     
end


Mime
View raw message