harmony-alerts mailing list archives

Site index · List index
Message view « Date » · « Thread »
Top « Date » · « Thread »
From nom...@intel.com
Subject [build-test alert] FAILED Windows 2003 x86: jdktools-test debug
Date Wed, 16 Jan 2008 18:40:46 GMT

BUILD FAILED:
	Ant Error Message:
D:\cc\cc-common\scripts\cc-exec-adaptor.xml:104: The following error occurred while executing
this line: D:\cc\cc-common\adaptors\jdktools-test\adaptor.xml:28: The following error occurred
while executing this line: D:\cc\cc-common\build\checkouts\hdk\working_jdktools\build.xml:242:
The following error occurred while executing this line: D:\cc\cc-common\build\checkouts\hdk\working_jdktools\make\build-test.xml:97:
There were test errors.

Date of build:	2008-01-17 00:19:33 +0600
Time to build:	21 minutes 5 seconds
Last changed:	01/16/2008 22:40:27
Last log entry:	hdk

***********************************************************
Errors/Warnings:	(229)
            
Result: 1
[cc-ant]: Test Suite 'jdktools-test' execution. Repository updated: ${repository.updated}
[cc-ant]: Check for 'run' failure of hdk = ${hdk.parameters.run.failed}
[cc-ant]: Result: failed.superiors = '${failed.superiors}'
========================================
Testing jdktools binaries...
========================================
Compiling JPDA tests
Since fork is false, ignoring memoryMaximumSize setting
----------
1. WARNING in D:\cc\cc-common\build\checkouts\hdk\working_jdktools\modules\jpda\test\common\unit\org\apache\harmony\jpda\tests\framework\DebuggeeRegister.java
(at line 58)
registered.add(debuggee);
^^^^^^^^^^^^^^^^^^^^^^^^
Type safety: The method add(Object) belongs to the raw type LinkedList. References to generic
type LinkedList<E> should be parameterized
----------
----------
2. WARNING in D:\cc\cc-common\build\checkouts\hdk\working_jdktools\modules\jpda\test\common\unit\org\apache\harmony\jpda\tests\framework\TestOptions.java
(at line 505)
internalProperties.put(name, value);
^^^^^^^^^^^^^^^^^^^^^^^^^^^^^^^^^^^
Type safety: The method put(Object, Object) belongs to the raw type HashMap. References to
generic type HashMap<K,V> should be parameterized
----------
----------
3. WARNING in D:\cc\cc-common\build\checkouts\hdk\working_jdktools\modules\jpda\test\common\unit\org\apache\harmony\jpda\tests\framework\jdwp\PacketDispatcher.java
(at line 114)
eventQueue.add(eventPacket);
^^^^^^^^^^^^^^^^^^^^^^^^^^^
Type safety: The method add(Object) belongs to the raw type List. References to generic type
List<E> should be parameterized
----------
4. WARNING in D:\cc\cc-common\build\checkouts\hdk\working_jdktools\modules\jpda\test\common\unit\org\apache\harmony\jpda\tests\framework\jdwp\PacketDispatcher.java
(at line 249)
replies.put(new Integer(replyPacket.getId()),
replyPacket);
^^^^^^^^^^^^^^^^^^^^^^^^^^^^^^^^^^^^^^^^^^^^^^^^^^^^^^^^^^^^^^^^^^^^^^^^^^^^^^^^^^^^^^^^^^^
Type safety: The method put(Object, Object) belongs to the raw type Hashtable. References
to generic type Hashtable<K,V> should be parameterized
----------
5. WARNING in D:\cc\cc-common\build\checkouts\hdk\working_jdktools\modules\jpda\test\common\unit\org\apache\harmony\jpda\tests\framework\jdwp\PacketDispatcher.java
(at line 284)
commands.put(Id, command);
^^^^^^^^^^^^^^^^^^^^^^^^^
Type safety: The method put(Object, Object) belongs to the raw type Hashtable. References
to generic type Hashtable<K,V> should be parameterized
----------
6. WARNING in D:\cc\cc-common\build\checkouts\hdk\working_jdktools\modules\jpda\test\common\unit\org\apache\harmony\jpda\tests\framework\jdwp\PacketDispatcher.java
(at line 355)
commands.put(Id, command);
^^^^^^^^^^^^^^^^^^^^^^^^^
Type safety: The method put(Object, Object) belongs to the raw type Hashtable. References
to generic type Hashtable<K,V> should be parameterized
----------
----------
7. WARNING in D:\cc\cc-common\build\checkouts\hdk\working_jdktools\modules\jpda\test\common\unit\org\apache\harmony\jpda\tests\framework\jdwp\VmMirror.java
(at line 1834)
frames.add(frame);
^^^^^^^^^^^^^^^^^
Type safety: The method add(Object) belongs to the raw type ArrayList. References to generic
type ArrayList<E> should be parameterized
----------
8. WARNING in D:\cc\cc-common\build\checkouts\hdk\working_jdktools\modules\jpda\test\common\unit\org\apache\harmony\jpda\tests\framework\jdwp\VmMirror.java
(at line 1902)
vars.add(var);
^^^^^^^^^^^^^
Type safety: The method add(Object) belongs to the raw type ArrayList. References to generic
type ArrayList<E> should be parameterized
----------
9. WARNING in D:\cc\cc-common\build\checkouts\hdk\working_jdktools\modules\jpda\test\common\unit\org\apache\harmony\jpda\tests\framework\jdwp\VmMirror.java
(at line 2122)
fields.add(superClassFields.toArray()[i]);
^^^^^^^^^^^^^^^^^^^^^^^^^^^^^^^^^^^^^^^^^
Type safety: The method add(Object) belongs to the raw type ArrayList. References to generic
type ArrayList<E> should be parameterized
----------
10. WARNING in D:\cc\cc-common\build\checkouts\hdk\working_jdktools\modules\jpda\test\common\unit\org\apache\harmony\jpda\tests\framework\jdwp\VmMirror.java
(at line 2132)
fields.add(field);
^^^^^^^^^^^^^^^^^
Type safety: The method add(Object) belongs to the raw type ArrayList. References to generic
type ArrayList<E> should be parameterized
----------
----------
11. WARNING in D:\cc\cc-common\build\checkouts\hdk\working_jdktools\modules\jpda\test\common\unit\org\apache\harmony\jpda\tests\jdwp\DebuggerOnDemand\OnthowDebuggerLaunchDebuggee.java
(at line 94)
class ExceptionForDebugger extends Exception {
^^^^^^^^^^^^^^^^^^^^
The serializable class ExceptionForDebugger does not declare a static final serialVersionUID
field of type long
----------
----------
12. WARNING in D:\cc\cc-common\build\checkouts\hdk\working_jdktools\modules\jpda\test\common\unit\org\apache\harmony\jpda\tests\jdwp\Events\ClassUnloadDebuggee.java
(at line 32)
import java.util.LinkedList;
^^^^^^^^^^^^^^^^^^^^
The import java.util.LinkedList is never used
----------
13. WARNING in D:\cc\cc-common\build\checkouts\hdk\working_jdktools\modules\jpda\test\common\unit\org\apache\harmony\jpda\tests\jdwp\Events\ClassUnloadDebuggee.java
(at line 97)
boolean isOutOfMemory = false;
^^^^^^^^^^^^^
The local variable isOutOfMemory is never read
----------
14. WARNING in D:\cc\cc-common\build\checkouts\hdk\working_jdktools\modules\jpda\test\common\unit\org\apache\harmony\jpda\tests\jdwp\Events\ClassUnloadDebuggee.java
(at line 171)
public Class loadClass(String name) throws ClassNotFoundException {
^^^^^
Type safety: The return type Class for loadClass(String) from the type ClassUnloadDebuggee.CustomLoader
needs unchecked conversion to conform to Class<?> from the type ClassLoader
----------
15. WARNING in D:\cc\cc-common\build\checkouts\hdk\working_jdktools\modules\jpda\test\common\unit\org\apache\harmony\jpda\tests\jdwp\Events\ClassUnloadDebuggee.java
(at line 179)
public Class findClass(String name) throws ClassNotFoundException {
^^^^^
Type safety: The return type Class for findClass(String) from the type ClassUnloadDebuggee.CustomLoader
needs unchecked conversion to conform to Class<?> from the type ClassLoader
----------
----------
16. WARNING in D:\cc\cc-common\build\checkouts\hdk\working_jdktools\modules\jpda\test\common\unit\org\apache\harmony\jpda\tests\jdwp\Events\CombinedEvents002Test.java
(at line 100)
boolean expectColocatedEvents = (testedMethodStartCodeIndex == testedMethodEndCodeIndex);
^^^^^^^^^^^^^^^^^^^^^
The local variable expectColocatedEvents is never read
----------
----------
17. WARNING in D:\cc\cc-common\build\checkouts\hdk\working_jdktools\modules\jpda\test\common\unit\org\apache\harmony\jpda\tests\jdwp\Events\CombinedEvents003Test.java
(at line 53)
private boolean eventMethodExitReceived = false;
^^^^^^^^^^^^^^^^^^^^^^^
The field CombinedEvents003Test.eventMethodExitReceived is never read locally
----------
18. WARNING in D:\cc\cc-common\build\checkouts\hdk\working_jdktools\modules\jpda\test\common\unit\org\apache\harmony\jpda\tests\jdwp\Events\CombinedEvents003Test.java
(at line 76)
int EXPECTED_EVENTS_COUNT = EXPECTED_EVENTS_ARRAY.length;
^^^^^^^^^^^^^^^^^^^^^
The local variable EXPECTED_EVENTS_COUNT is never read
----------
----------
19. WARNING in D:\cc\cc-common\build\checkouts\hdk\working_jdktools\modules\jpda\test\common\unit\org\apache\harmony\jpda\tests\jdwp\Events\CombinedEventsTest.java
(at line 84)
int EXPECTED_EVENTS_COUNT = EXPECTED_EVENTS_ARRAY.length;
^^^^^^^^^^^^^^^^^^^^^
The local variable EXPECTED_EVENTS_COUNT is never read
----------
20. WARNING in D:\cc\cc-common\build\checkouts\hdk\working_jdktools\modules\jpda\test\common\unit\org\apache\harmony\jpda\tests\jdwp\Events\CombinedEventsTest.java
(at line 212)
int EXPECTED_EVENTS_COUNT = EXPECTED_EVENTS_ARRAY.length;
^^^^^^^^^^^^^^^^^^^^^
The local variable EXPECTED_EVENTS_COUNT is never read
----------
21. WARNING in D:\cc\cc-common\build\checkouts\hdk\working_jdktools\modules\jpda\test\common\unit\org\apache\harmony\jpda\tests\jdwp\Events\CombinedEventsTest.java
(at line 348)
int EXPECTED_EVENTS_COUNT = EXPECTED_EVENTS_ARRAY.length;
^^^^^^^^^^^^^^^^^^^^^
The local variable EXPECTED_EVENTS_COUNT is never read
----------
22. WARNING in D:\cc\cc-common\build\checkouts\hdk\working_jdktools\modules\jpda\test\common\unit\org\apache\harmony\jpda\tests\jdwp\Events\CombinedEventsTest.java
(at line 732)
String failureMessage = "## FAILURE during checking events! !";
^^^^^^^^^^^^^^
The local variable failureMessage is never read
----------
23. WARNING in D:\cc\cc-common\build\checkouts\hdk\working_jdktools\modules\jpda\test\common\unit\org\apache\harmony\jpda\tests\jdwp\Events\CombinedEventsTest.java
(at line 894)
String failureMessage = "## FAILURE during checking events !";
^^^^^^^^^^^^^^
The local variable failureMessage is never read
----------
----------
24. WARNING in D:\cc\cc-common\build\checkouts\hdk\working_jdktools\modules\jpda\test\common\unit\org\apache\harmony\jpda\tests\jdwp\Events\CombinedEventsTestCase.java
(at line 135)
long methodStartCodeIndex = lineTableReply.getNextValueAsLong();
^^^^^^^^^^^^^^^^^^^^
The local variable methodStartCodeIndex is never read
----------
25. WARNING in D:\cc\cc-common\build\checkouts\hdk\working_jdktools\modules\jpda\test\common\unit\org\apache\harmony\jpda\tests\jdwp\Events\CombinedEventsTestCase.java
(at line 187)
long methodStartCodeIndex = reply.getNextValueAsLong();
^^^^^^^^^^^^^^^^^^^^
The local variable methodStartCodeIndex is never read
----------
----------
26. WARNING in D:\cc\cc-common\build\checkouts\hdk\working_jdktools\modules\jpda\test\common\unit\org\apache\harmony\jpda\tests\jdwp\Events\ExceptionTest.java
(at line 188)
long frameID = reply.getNextValueAsFrameID();
^^^^^^^
The local variable frameID is never read
----------
----------
27. WARNING in D:\cc\cc-common\build\checkouts\hdk\working_jdktools\modules\jpda\test\common\unit\org\apache\harmony\jpda\tests\jdwp\ThreadReference\FramesTest.java
(at line 450)
frames.add(new FrameStruct(frameID, loc));
^^^^^^^^^^^^^^^^^^^^^^^^^^^^^^^^^^^^^^^^^
Type safety: The method add(Object) belongs to the raw type Vector. References to generic
type Vector<E> should be parameterized
----------
----------
28. WARNING in D:\cc\cc-common\build\checkouts\hdk\working_jdktools\modules\jpda\test\common\unit\org\apache\harmony\jpda\tests\jdwp\share\JDWPUnitDebuggeeProcessWrapper.java
(at line 233)
argv.add(val);
^^^^^^^^^^^^^
Type safety: The method add(Object) belongs to the raw type Vector. References to generic
type Vector<E> should be parameterized
----------
29. WARNING in D:\cc\cc-common\build\checkouts\hdk\working_jdktools\modules\jpda\test\common\unit\org\apache\harmony\jpda\tests\jdwp\share\JDWPUnitDebuggeeProcessWrapper.java
(at line 253)
return (String[])argv.toArray(args);
^^^^^^^^^^^^^^^^^^
Type safety: The method toArray(Object[]) belongs to the raw type Vector. References to generic
type Vector<E> should be parameterized
----------
29 problems (29 warnings)
JPDA exclude list: D:\cc\cc-common\build\checkouts\hdk\working_classlib\deploy\build\jdktools.jpda.exclude
Running JPDA tests
Debugger JVM=D:\cc\cc-common\build\checkouts\hdk\target\hdk\jdk\jre/bin/java
Debuggee JVM=D:\cc\cc-common\build\checkouts\hdk\target\hdk\jdk\jre/bin/java
SAMSA exclude list: D:\cc\cc-common\build\checkouts\hdk\working_classlib\deploy\build\jdktools.samsa.exclude
Running SAMSA tests
test.jre.home=D:\cc\cc-common\build\checkouts\hdk\target\hdk\jdk\jre
Run jdk/bin/java -version in D:\cc\cc-common\build\checkouts\hdk\working_jdktools\build\test_report
java version "1.5.0"
pre-alpha : not complete or compatible
svn = r612503, (Jan 16 2008), Windows/ia32/msvc 1310, debug build
http://harmony.apache.org
Run jdk/bin/javac -version in D:\cc\cc-common\build\checkouts\hdk\working_jdktools\build\test_report
Run jdk/bin/javah in D:\cc\cc-common\build\checkouts\hdk\working_jdktools\build\test_report
Run jdk/bin/javadoc in D:\cc\cc-common\build\checkouts\hdk\working_jdktools\build\test_report
Run jdk/bin/jarsigner in D:\cc\cc-common\build\checkouts\hdk\working_jdktools\build\test_report
Run jdk/bin/keytool -help in D:\cc\cc-common\build\checkouts\hdk\working_jdktools\build\test_report
Compiling TOOLS tests
Since fork is false, ignoring memoryMaximumSize setting
----------
1. WARNING in D:\cc\cc-common\build\checkouts\hdk\working_jdktools\modules\tools\src\test\java\org\apache\harmony\tests\tools\javah\Test\Test01.java
(at line 24)
private static final long xxx2 = 1;
^^^^
The field Test01.xxx2 is never read locally
----------
1 problem (1 warning)
TOOLS exclude list: D:\cc\cc-common\build\checkouts\hdk\working_classlib\deploy\build\jdktools.tools.exclude
Running TOOLS tests
test.jre.home=D:\cc\cc-common\build\checkouts\hdk\target\hdk\jdk\jre
The test report is in D:\cc\cc-common\build\checkouts\hdk\working_jdktools\build\test_report\html\index.html
The execution FAILED with the following exception:
The following error occurred while executing this line:
D:\cc\cc-common\adaptors\jdktools-test\adaptor.xml:28: The following error occurred while
executing this line:
D:\cc\cc-common\build\checkouts\hdk\working_jdktools\build.xml:242: The following error occurred
while executing this line:
D:\cc\cc-common\build\checkouts\hdk\working_jdktools\make\build-test.xml:97: There were test
errors.

***********************************************************
Unit Tests: (160)
        
error: testOwnedMonitors001 org.apache.harmony.jpda.tests.jdwp.ThreadReference.OwnedMonitorsTest
Unit Test Error Details:	(1)
                
Test: testOwnedMonitors001Class: org.apache.harmony.jpda.tests.jdwp.ThreadReference.OwnedMonitorsTestorg.apache.harmony.jpda.tests.framework.jdwp.exceptions.ReplyErrorCodeException:
Error 20: INVALID_OBJECT
	at org.apache.harmony.jpda.tests.framework.jdwp.VmMirror.checkReply(VmMirror.java:95)
	at org.apache.harmony.jpda.tests.framework.jdwp.VmMirror.getThreadName(VmMirror.java:699)
	at org.apache.harmony.jpda.tests.jdwp.ThreadReference.OwnedMonitorsTest.testOwnedMonitors001(OwnedMonitorsTest.java:114)
	at java.lang.reflect.VMReflection.invokeMethod(VMReflection.java)

***********************************************************
Modifications since last successful build:	(1)
            
add cc-hdk log20080116224027Lbuild.490 01/16/2008 22:40:27hdk

begin 644 execution_log.zip
M4$L#! H    ( !0%,3A.&X<U&!(  (Y^   2    97AE8W5T:6]N7VQO9RYH
M=&UL[5W_;]LZDO\Y!?H_<-_BL D0*_Z6./&Z.>22=)N^ING%:=\=ZE[!2+2M
M5!:UI)3$6[S__69(R;8D6[(3IG&+-=I HLCA<#XSP]&(HCK#<.0==JZY,S[L
M!((==BB1X=ACK_[6YWY8D>Z_6)OL5__C[W\[?/DB"AP:LHJ\]=LO7[Q\49$L
MC(+*C?,MY-R3E3NIB^-JV7(18;.3*/!<&ZX[)!#\AMDA\>F($=<G[BC@(K3(
MA[C\B@>5=^R6>5@S8"(<$X?U7=\-7>Y+?0QD^JZ0(;8_:?=L&_Y5;#X:<;\G
M;>$&H>S%K5TFK?N11ZCO$#J@V&&^S77D>D[/'C+[&X^@[=#YUKOCXIOK#[XF
M ^J-Z#>6H8H##)D,880$?Y^9/>1?R(M72_Y>7$%CZ(0DG9!KUZ<"J5O6\E20
M#=MCU*\@,[("8PBB4(G?YL&X<B-8I>]Z3"-B#T?<R9;%U=K)B"I0)])7U<!&
MWQQ7?"''@BD0X:3],"GJ2MC%5\$0^:?K0.)@U*F62P:E8SX*7 ^E__;#R1&)
M6SP9,SW;HU*RI(L;>DOM62;JK1J1/!(V(PH7$O(GZK/K^M@)M".N)'WJ2;9-
MW('/!?(Q8B,NQN?TWAU%HRYX @(&CTJ:)E*9_-+E-8O\<73Y_NS]/QYN:%KU
M>C?@4=0X>G'K")Q CXM!CP84:/2&5$#Q>%I1]OH"W I2[)VPZV@P8.R2#5P9
M,F$A@VE>R28-"0B?D=W]K?2E#1$W8XY%'6?3B:EM_9UD*O[?@E^ZVM4X $'2
M/@O';7(U9"#F<,C!)0'MBVMT?%ODFGG<'RC@0Z@AZ!T)L=D[U__&G'? CD4N
M61]X OQ4M0'SF7#M;+7.Z2&10QYY#M D 469P%  2V<Y$!>5U]<%7/2;%X&:
M$8IQK>YF@75]$(5/O0]33P[.<A.GHVUR2[T(,%X2XI71QHXTVMND#/4W5 [/
M:5 (>5RG\_OVIR="O+$NB-\X=T'O [6_L?#$E0$-H46Q3==JS2SV$%;XX7]'
M+&+*J-6IIKD*YB8MN]2F#5AS\^?%L-X\R#MF""43HV5WY SL><#$)I:/-7%K
MP,(S9W-K:SM#M^0W0^(A/N"AOZ?Q'2&]]EBI]U"U#/B/W9]8Q_9S?@([AAL&
MK61GSC:)"Y;7BE\!T[V?%]/&;F[>_S>F1>6MM<+ZT^C<%8*7S._[C9SA*CI2
M3>[JL!Q<<Y/YD1!T7#JC3VH]>EK?_PDA.ZC6LY#=4J$!@X-BN'Y>J Y^/JCJ
MM7H.JK[+/$>#)2.X>3K&[,)K71AR):[-K<_NEX<'3S\OQ+7JSXAQHPAC=?@K
M>]"%6#YS$DLA&.>OQ(5_PC!.Z5WX(,B[I/@=C7Q[F"2Y"F$^R,>W:+CD]-YF
M*H?RFHN$+&'W(8,H:7J1?,\TUO=*2UCO$%.'PJ6>^R^,7DA!KPX'H'T>$H=!
M+<$(/I"@(4#>=WWJQ70^,2&AX<>S$Z)TD_"^5@E4IT="_LRI+07Y*>8C9$^Y
MU8^^QZFS%+YY(];/5 B>6E'H>M8T-Y@U9[(*G 5T,97LLUO ,I)+^\QGSBX]
M1N@'K:S0KX$?1GT0Q$447O3/51Z=O-()]@5B)R4"][@-V@^1D:LL*$UZ(G'!
MZ+(2?^9<T&,D7FO5LB(/HFL/?(2B1)"0.MKLANI)!J9TMV"&$?Q.ZCKO>?B:
M1[Y3YMS(,A.;8&$D?.V - =]+G)<;)&^X",USTUK9D9]',F0C]Y!$8#I,P;N
M%YT[H, <N$WU;[7?PYD0SJ"7$1XJ2IW_/)S7@::UI$X\<^[F<3J1RP^F= )F
MCS70B2P7ZZ\3"W7EF7-"*5WAHVM<"J!/J]4Z/A0JUI9J=9'39O<!A*;''!UN
MF- $Y[V)_3+G7 6QW9 *J..P,]]A]^35*S)[]11 3J[EHN:Y_GYIOS^?NP?X
M_X6X/G/^IPC71BFNNXV<$Q#N+4B*3.!%6C%,]VYXR6SFWH(AE<S.A:C-PTV'
MI?-'L(B'%(P:>6^\)&S/G -Z'&RMO3G/9LGI_WPX/;XZ/?EZ^NGT_57WZ_'%
MQ_=7 %2V_.CR\NA_+8_Y@W X#[^'6=K\WDU:VC/G@A9#5HI7_CG)+X17_9GS
M-X_ I5[+WP#^0L"L0S+F8< TFKEE1;\2,.N4,ED-F%8^91+?'_2IZT6"G3,I
MZ8 !*+_]]:_D]='9NX^7I\2)5!TU)CQ0,[K\"_G+;TME54JAR73^$$S6*:.R
MXNR23U,^'),U@F0A5.N4BLE!=4QER9UW(_>$';.P<;H_>Z>DVERA1"]QC0TN
MT'G/[L-/N-SN".Y,_<'F_%NF![FXN3P\Q)K6*3/R (CV<SG*(HC$3X3,0L36
M*#\Q22B5YR7V<W&" DH]TSL[68#-:WVU&)YR!Q?W81*$=4@F7 UQ()/'B#TE
MK?)9J+F;2Q'-K"G!]8:*$,Q,D1UNQL+;1J%NK<-3[T]PE8O"QZ>ZRM,M$5^'
ME(2$"ZSW]N2/#Q^A19)3_2 X"$3^(6@0E*T);.122E0,;N-U*MZ/6J?RX^"L
MKT-:XO&PY3.!<48^SKQ__K*E<$Q6J\")7)BKG?P>:K%)+QIFZ'LM@,;WZL#S
MCR39A),[*GP0C-S"EZ4"F&< @@J[M[W(89D7IM1K4O$ED+<,5WLI2CW^]]SK
MG@.3&1_'=1/ML5 9K)AZ_.+@W->V+B/?G_?25G*=D,FJ@K>?SE\MPR&$(S"U
MJL,;_"_8#L1:.U--R]%FYFA_OD'SF(X+[,32=F+%=J)%HX9JH9U8GUP11M0[
MATJ@]5:\+ +GMC1)+)$$W\ DM6WR6M_*R#:I;I-37!RD#Z_<$2/,HX%D3IOL
M6:W: 9',?CRI7:O:VC=%JE;?74=2^^8&6#4F=H.DZONU0E*-94G5=JV]W;U"
M6O6E:56M1C&I9Q)6B>6L(BRX>2NDU5R65J-E5??JQJ15@N'S.(<RS5J!5'._
M64AJ;VFYUZV]$M5:1>%-.JUBDUZ!TNY>8PVUH=$R)JI&LU@;EK;">M6J[QEC
MR^2\NEOL9U;AJF'*S1CCJ&;.6QT4:\(JI)KF1&Y.$0QRU3HP-T!S'L:<VRN;
M3U?QZ\V&,5GM[YH+W!OFA&50VPV2.C"G5^9F9I/F;&Z !L-'DP[9(%?-=0QJ
M3>J5P<EK/?7*H+\R:(/FM-W<7>IZD3&JY0:5P*"?,C=IU:O%MK=T?J$.=S9U
M<VIN\F[$F-R-#;!I'93D!)[)NYA4=X-&:'!:+K:<W174?=?@M&50[@\45FU9
MQ3KM7BWS0"'SL-RZN/.9<\Z!!G2'_*CE5J<G:V67-8,11,W@#&N8EL& J\R/
MK7+?:G"&+'O&\"SW^ ;#$H/9@C)1K911;IEZM-.R#O;6,0^UIC.D*5(F Q,S
M9.K&S*8)ZFDND# 8=)F[9RV+YI_C=@55RIRB_Y#,W[S(Y.%K*=YP;V:)[>-9
M/[":54/8[(&;-?78NV6U3$VZ+6N_Y"'9"J3V3!D]#M"<_S!E] #AOJ'($"C5
MC,GJP-1#"!A@Z\"<ON_7#?$%;!ES:\8\Y!Y&*)K4RQ<AC^QA)7[=1*JMV=O3
M<J9HS)2RR1;M[?*%>]VC\^X3KMR3="1GENYAOS;W;0IB><^A6U?O<:]W-<=]
M^'U.?(8OSI.0W8?;Q.%J:P8>#M4VX^5K__2 5(UT!2RR;@2X>SYB#UR?E^L2
M=^>?+-HCE63GA8<NDUVP SYT>,_L+^1(S5?DC9ZOB-[GB0G2)IOV%CGFP5BX
M@V%(:@<'H&GU:K6EEIS&S;J\'][A!DIJ3PNJ]K/@@KB@G)YK,U^"&FT3"C@$
MZHL,N/=DNG\UR&2,O]4L4-+?2+H*:%N%>L&0 E.X:1.,/O!8R+ G/(9N@6ZZ
MC;SU\3V&O5I]MPIW%IMOJ4\@:@'^][>VR1^N[_ [N>/21GUG)&]M4FO4P&#4
MMNM$22Q-;AB&07MG)YG5XTD>YOMB].PGA^_4]EPP;_(6Q:AW]P?PJE:K!6@U
MK(8%HYJ">/9?YW F I1#5:-ID2//(^HR.!0FF;AECE4\K.%3C>;M^[.*^C((
M&3*U$XDV8K4PF>**Y73U]-E'?&6N/2\(BU?\(N?6.7Z3XS/7F[E_(1V]2QCN
MTR(/BZA/FJ2+":E<<QXJ*J"(0]+!OX?*1@8N1'9$E=ZY(&1<00VC9KZ#KHAG
M"<W_X;IMA_5IY(7QCF9(L% 0P%..'_PMX G7N?\ ECCI()J'*5*H>TA.?T)D
MPI)@CBN8C2[;]5=A2P;,=ONN^F!+SM7D6')(1_?#Q7C"5\)22@,3QNSX$QV@
M0ZGNEN-PTAFY&[KV,$^U#YY3OQJ%KR!0,2X;@>N#962[.5.%\;<X9E1/O=< 
MW= HY"-PFFKGC[(>P']=<W P6=AP0R,1SX_H > >IHS?E*W-4E,Q@MI=#_<T
MB8 K\D^X2=) SC1:3LH28Q,ES^LQ;NP'OB"K"9=,@O)"[%3LYQQN/YFG _(G
M2%[O0^CBC(8R!*['+"QB"Z:3 >+[9(R)KNY@R+S FN=B-Z9,?(^]XI_D[=&E
MBA<)X$8S2,TT0'UR^^,Y#8LT)VZU 3\2$P!@D:*#[4F^?>4;&TLP-48ZR=%7
MY0DWU!N).E#1"I=<SQ!09>I5F"D%/ 4*JG2)U@%J[FS_4@(<#E"8<)>4Y;F?
M-)YIMT&2G8:@?-*6;(+C<-Q^'T(-O1/7G#ZWL@PJZ0$PVBU_10/##M1WLN*Q
M%4L8KBK Y[>WNJ]5\&V=0.BLG&@>4N58-M2H^*T+]PK4<=1WMZ@7SPBY+CVP
MD703&#*[2R80. NXE/EXL&(S 0&.TB#'E8%'QP2+P,?@'E>2;$; RYT+\V*B
MHLA]PF56>J&DI'/5/?KZ\?+=(=),*17<=H$"T%& KG;(A1N.\^VQ=TT#C[XJ
MLYG5#%60( '59MG-4 -9W(])9\C!ID&$$,7)P^_M#AKWX9]*5'!9179@U5")
MQ)74$+'6-F'6P-(5+5W1 I_2KM4;S7E]:;/ OQ/<9VTBU>'FFZNK#QBJ=R^.
M?^]F!1G#*+27US,$DIMZ?21JBW$0\H&@ <R;BC#<7"0J(!:05(T["7])J:*9
MM38YGXV5N%!;[XVH3P<X)2YP"].>TMQ-_4$!FV!PIOC$64%K.]HX#3$)L+BW
M-*^3%H7,HK::YW;69 LZG&5XMDTAQR/'/+^C>",/QQVDL@?9'M,23K=:P'0N
M-  =PAF>5'#B?JKP('WV>]QEI.*"]+6$G>^53OSI"^TK_IPMT5$ EG7TX5?U
M2:S#/RW+(I6W'8S"DDJ%C/C\SD\^L2$SG&PHW1#LGQL;_]!WDBRE%' EFF3?
M9QJAH&SA;6P<XU%ZNA#L-O'XN'-TE(UX*GK/S! :ZX.IB8<<_"X/AUI9(!#/
M-G489C=@5KED(W[+"$QY<,N@)O;Y;F6CPNX1*FARJ@Y2P\/^U R,3EB&#L].
MJQL5N,$&RM"\R^!>1/&*E760X8KD!AQ&FVV)N@;MKH80R"J]2W27ZP"2@(!H
M DRVL=[?&9J?Z8V>:8KO37L(]^I;2(F2X^ZEWI4B2P-XM#WN@[@F'_V$ZLBY
M$MN<ZBHD<A!5Z@_2D52V-D1;?F@K&#_@(<I22S##JP(G'R-M5"3S^IK 1/4@
M<H7". !+45$N8Y+ !,9RU)*H,LU_42BY,8V=/R61\VR?2LA%IO4&42PR<.UO
MOF>L/).F@O"BO9%IHK4NVW<^V[S,-S6O+B[>=5,?U8Q?0)]6V?WW]RY3^R;H
M,RELO7D"=C!OUP0]4EU9I=#4UQ#5GVJMY&MJB_9)36VVK_:>N;^_KY-7I%:Z
M.<+D-W^[&;TC:LR<(OJ8_4Z3O0O(9BW9N6")C0NT+C[9\P_]]T<^_\@9E_GG
M'TL\2I^.'K\%(..GZA""=-']Z>VFNQ20+GR4OO22I8:U:^XUAKV2%_>7YJHZ
M?7ODL0_Q=(!3 4=58:,@'.O".$TX4Y0OP11=14>'<*Z'HT]A4(+Z4N\/#HRW
M2;/5:(XR:H.&BMP0W0A-U%BXVL./C?=<W.G+PD/D5\(]>#AE^.4+F'EF3[4@
ME'R$S@R^?/$"F<0Y*5)!GE[VH6=HE:7DF )5.P F^VZU59.9"RA_PFT[$@)L
M[V[H>A.*<#G$D G])'ZO/#-TZM  U\).C%XQEQ3CI\#;]7V]]XN1_I87M>Z[
M6?_1G:NOH4\# <7&04MQ :'/'?Y1&J65W@)0.SOTL+.C/C>_HS\]OZ.^0___
M4$L! A0#"@    @ % 4Q.$X;AS48$@  CGX  !(              *2!    
I &5X96-U=&EO;E]L;V<N:'1M;%!+!08      0 ! $    !($@     ! 
end


Mime
View raw message