harmony-alerts mailing list archives

Site index · List index
Message view « Date » · « Thread »
Top « Date » · « Thread »
From nom...@intel.com
Subject [build-test alert] FAILED Windows 2003 x86: jdktools-test debug
Date Mon, 14 Jan 2008 16:23:43 GMT

BUILD FAILED:
	Ant Error Message:
D:\cc\cc-common\scripts\cc-exec-adaptor.xml:104: The following error occurred while executing
this line: D:\cc\cc-common\adaptors\jdktools-test\adaptor.xml:28: The following error occurred
while executing this line: D:\cc\cc-common\build\checkouts\hdk\working_jdktools\build.xml:242:
The following error occurred while executing this line: D:\cc\cc-common\build\checkouts\hdk\working_jdktools\make\build-test.xml:97:
There were test errors.

Date of build:	2008-01-14 22:02:41 +0600
Time to build:	20 minutes 55 seconds
Last changed:	01/14/2008 20:23:45
Last log entry:	hdk

***********************************************************
Errors/Warnings:	(229)
            
Result: 1
[cc-ant]: Test Suite 'jdktools-test' execution. Repository updated: ${repository.updated}
[cc-ant]: Check for 'run' failure of hdk = ${hdk.parameters.run.failed}
[cc-ant]: Result: failed.superiors = '${failed.superiors}'
========================================
Testing jdktools binaries...
========================================
Compiling JPDA tests
Since fork is false, ignoring memoryMaximumSize setting
----------
1. WARNING in D:\cc\cc-common\build\checkouts\hdk\working_jdktools\modules\jpda\test\common\unit\org\apache\harmony\jpda\tests\framework\DebuggeeRegister.java
(at line 58)
registered.add(debuggee);
^^^^^^^^^^^^^^^^^^^^^^^^
Type safety: The method add(Object) belongs to the raw type LinkedList. References to generic
type LinkedList<E> should be parameterized
----------
----------
2. WARNING in D:\cc\cc-common\build\checkouts\hdk\working_jdktools\modules\jpda\test\common\unit\org\apache\harmony\jpda\tests\framework\TestOptions.java
(at line 505)
internalProperties.put(name, value);
^^^^^^^^^^^^^^^^^^^^^^^^^^^^^^^^^^^
Type safety: The method put(Object, Object) belongs to the raw type HashMap. References to
generic type HashMap<K,V> should be parameterized
----------
----------
3. WARNING in D:\cc\cc-common\build\checkouts\hdk\working_jdktools\modules\jpda\test\common\unit\org\apache\harmony\jpda\tests\framework\jdwp\PacketDispatcher.java
(at line 114)
eventQueue.add(eventPacket);
^^^^^^^^^^^^^^^^^^^^^^^^^^^
Type safety: The method add(Object) belongs to the raw type List. References to generic type
List<E> should be parameterized
----------
4. WARNING in D:\cc\cc-common\build\checkouts\hdk\working_jdktools\modules\jpda\test\common\unit\org\apache\harmony\jpda\tests\framework\jdwp\PacketDispatcher.java
(at line 249)
replies.put(new Integer(replyPacket.getId()),
replyPacket);
^^^^^^^^^^^^^^^^^^^^^^^^^^^^^^^^^^^^^^^^^^^^^^^^^^^^^^^^^^^^^^^^^^^^^^^^^^^^^^^^^^^^^^^^^^^
Type safety: The method put(Object, Object) belongs to the raw type Hashtable. References
to generic type Hashtable<K,V> should be parameterized
----------
5. WARNING in D:\cc\cc-common\build\checkouts\hdk\working_jdktools\modules\jpda\test\common\unit\org\apache\harmony\jpda\tests\framework\jdwp\PacketDispatcher.java
(at line 284)
commands.put(Id, command);
^^^^^^^^^^^^^^^^^^^^^^^^^
Type safety: The method put(Object, Object) belongs to the raw type Hashtable. References
to generic type Hashtable<K,V> should be parameterized
----------
6. WARNING in D:\cc\cc-common\build\checkouts\hdk\working_jdktools\modules\jpda\test\common\unit\org\apache\harmony\jpda\tests\framework\jdwp\PacketDispatcher.java
(at line 355)
commands.put(Id, command);
^^^^^^^^^^^^^^^^^^^^^^^^^
Type safety: The method put(Object, Object) belongs to the raw type Hashtable. References
to generic type Hashtable<K,V> should be parameterized
----------
----------
7. WARNING in D:\cc\cc-common\build\checkouts\hdk\working_jdktools\modules\jpda\test\common\unit\org\apache\harmony\jpda\tests\framework\jdwp\VmMirror.java
(at line 1834)
frames.add(frame);
^^^^^^^^^^^^^^^^^
Type safety: The method add(Object) belongs to the raw type ArrayList. References to generic
type ArrayList<E> should be parameterized
----------
8. WARNING in D:\cc\cc-common\build\checkouts\hdk\working_jdktools\modules\jpda\test\common\unit\org\apache\harmony\jpda\tests\framework\jdwp\VmMirror.java
(at line 1902)
vars.add(var);
^^^^^^^^^^^^^
Type safety: The method add(Object) belongs to the raw type ArrayList. References to generic
type ArrayList<E> should be parameterized
----------
9. WARNING in D:\cc\cc-common\build\checkouts\hdk\working_jdktools\modules\jpda\test\common\unit\org\apache\harmony\jpda\tests\framework\jdwp\VmMirror.java
(at line 2122)
fields.add(superClassFields.toArray()[i]);
^^^^^^^^^^^^^^^^^^^^^^^^^^^^^^^^^^^^^^^^^
Type safety: The method add(Object) belongs to the raw type ArrayList. References to generic
type ArrayList<E> should be parameterized
----------
10. WARNING in D:\cc\cc-common\build\checkouts\hdk\working_jdktools\modules\jpda\test\common\unit\org\apache\harmony\jpda\tests\framework\jdwp\VmMirror.java
(at line 2132)
fields.add(field);
^^^^^^^^^^^^^^^^^
Type safety: The method add(Object) belongs to the raw type ArrayList. References to generic
type ArrayList<E> should be parameterized
----------
----------
11. WARNING in D:\cc\cc-common\build\checkouts\hdk\working_jdktools\modules\jpda\test\common\unit\org\apache\harmony\jpda\tests\jdwp\DebuggerOnDemand\OnthowDebuggerLaunchDebuggee.java
(at line 94)
class ExceptionForDebugger extends Exception {
^^^^^^^^^^^^^^^^^^^^
The serializable class ExceptionForDebugger does not declare a static final serialVersionUID
field of type long
----------
----------
12. WARNING in D:\cc\cc-common\build\checkouts\hdk\working_jdktools\modules\jpda\test\common\unit\org\apache\harmony\jpda\tests\jdwp\Events\ClassUnloadDebuggee.java
(at line 32)
import java.util.LinkedList;
^^^^^^^^^^^^^^^^^^^^
The import java.util.LinkedList is never used
----------
13. WARNING in D:\cc\cc-common\build\checkouts\hdk\working_jdktools\modules\jpda\test\common\unit\org\apache\harmony\jpda\tests\jdwp\Events\ClassUnloadDebuggee.java
(at line 97)
boolean isOutOfMemory = false;
^^^^^^^^^^^^^
The local variable isOutOfMemory is never read
----------
14. WARNING in D:\cc\cc-common\build\checkouts\hdk\working_jdktools\modules\jpda\test\common\unit\org\apache\harmony\jpda\tests\jdwp\Events\ClassUnloadDebuggee.java
(at line 171)
public Class loadClass(String name) throws ClassNotFoundException {
^^^^^
Type safety: The return type Class for loadClass(String) from the type ClassUnloadDebuggee.CustomLoader
needs unchecked conversion to conform to Class<?> from the type ClassLoader
----------
15. WARNING in D:\cc\cc-common\build\checkouts\hdk\working_jdktools\modules\jpda\test\common\unit\org\apache\harmony\jpda\tests\jdwp\Events\ClassUnloadDebuggee.java
(at line 179)
public Class findClass(String name) throws ClassNotFoundException {
^^^^^
Type safety: The return type Class for findClass(String) from the type ClassUnloadDebuggee.CustomLoader
needs unchecked conversion to conform to Class<?> from the type ClassLoader
----------
----------
16. WARNING in D:\cc\cc-common\build\checkouts\hdk\working_jdktools\modules\jpda\test\common\unit\org\apache\harmony\jpda\tests\jdwp\Events\CombinedEvents002Test.java
(at line 100)
boolean expectColocatedEvents = (testedMethodStartCodeIndex == testedMethodEndCodeIndex);
^^^^^^^^^^^^^^^^^^^^^
The local variable expectColocatedEvents is never read
----------
----------
17. WARNING in D:\cc\cc-common\build\checkouts\hdk\working_jdktools\modules\jpda\test\common\unit\org\apache\harmony\jpda\tests\jdwp\Events\CombinedEvents003Test.java
(at line 53)
private boolean eventMethodExitReceived = false;
^^^^^^^^^^^^^^^^^^^^^^^
The field CombinedEvents003Test.eventMethodExitReceived is never read locally
----------
18. WARNING in D:\cc\cc-common\build\checkouts\hdk\working_jdktools\modules\jpda\test\common\unit\org\apache\harmony\jpda\tests\jdwp\Events\CombinedEvents003Test.java
(at line 76)
int EXPECTED_EVENTS_COUNT = EXPECTED_EVENTS_ARRAY.length;
^^^^^^^^^^^^^^^^^^^^^
The local variable EXPECTED_EVENTS_COUNT is never read
----------
----------
19. WARNING in D:\cc\cc-common\build\checkouts\hdk\working_jdktools\modules\jpda\test\common\unit\org\apache\harmony\jpda\tests\jdwp\Events\CombinedEventsTest.java
(at line 84)
int EXPECTED_EVENTS_COUNT = EXPECTED_EVENTS_ARRAY.length;
^^^^^^^^^^^^^^^^^^^^^
The local variable EXPECTED_EVENTS_COUNT is never read
----------
20. WARNING in D:\cc\cc-common\build\checkouts\hdk\working_jdktools\modules\jpda\test\common\unit\org\apache\harmony\jpda\tests\jdwp\Events\CombinedEventsTest.java
(at line 212)
int EXPECTED_EVENTS_COUNT = EXPECTED_EVENTS_ARRAY.length;
^^^^^^^^^^^^^^^^^^^^^
The local variable EXPECTED_EVENTS_COUNT is never read
----------
21. WARNING in D:\cc\cc-common\build\checkouts\hdk\working_jdktools\modules\jpda\test\common\unit\org\apache\harmony\jpda\tests\jdwp\Events\CombinedEventsTest.java
(at line 348)
int EXPECTED_EVENTS_COUNT = EXPECTED_EVENTS_ARRAY.length;
^^^^^^^^^^^^^^^^^^^^^
The local variable EXPECTED_EVENTS_COUNT is never read
----------
22. WARNING in D:\cc\cc-common\build\checkouts\hdk\working_jdktools\modules\jpda\test\common\unit\org\apache\harmony\jpda\tests\jdwp\Events\CombinedEventsTest.java
(at line 732)
String failureMessage = "## FAILURE during checking events! !";
^^^^^^^^^^^^^^
The local variable failureMessage is never read
----------
23. WARNING in D:\cc\cc-common\build\checkouts\hdk\working_jdktools\modules\jpda\test\common\unit\org\apache\harmony\jpda\tests\jdwp\Events\CombinedEventsTest.java
(at line 894)
String failureMessage = "## FAILURE during checking events !";
^^^^^^^^^^^^^^
The local variable failureMessage is never read
----------
----------
24. WARNING in D:\cc\cc-common\build\checkouts\hdk\working_jdktools\modules\jpda\test\common\unit\org\apache\harmony\jpda\tests\jdwp\Events\CombinedEventsTestCase.java
(at line 135)
long methodStartCodeIndex = lineTableReply.getNextValueAsLong();
^^^^^^^^^^^^^^^^^^^^
The local variable methodStartCodeIndex is never read
----------
25. WARNING in D:\cc\cc-common\build\checkouts\hdk\working_jdktools\modules\jpda\test\common\unit\org\apache\harmony\jpda\tests\jdwp\Events\CombinedEventsTestCase.java
(at line 187)
long methodStartCodeIndex = reply.getNextValueAsLong();
^^^^^^^^^^^^^^^^^^^^
The local variable methodStartCodeIndex is never read
----------
----------
26. WARNING in D:\cc\cc-common\build\checkouts\hdk\working_jdktools\modules\jpda\test\common\unit\org\apache\harmony\jpda\tests\jdwp\Events\ExceptionTest.java
(at line 188)
long frameID = reply.getNextValueAsFrameID();
^^^^^^^
The local variable frameID is never read
----------
----------
27. WARNING in D:\cc\cc-common\build\checkouts\hdk\working_jdktools\modules\jpda\test\common\unit\org\apache\harmony\jpda\tests\jdwp\ThreadReference\FramesTest.java
(at line 450)
frames.add(new FrameStruct(frameID, loc));
^^^^^^^^^^^^^^^^^^^^^^^^^^^^^^^^^^^^^^^^^
Type safety: The method add(Object) belongs to the raw type Vector. References to generic
type Vector<E> should be parameterized
----------
----------
28. WARNING in D:\cc\cc-common\build\checkouts\hdk\working_jdktools\modules\jpda\test\common\unit\org\apache\harmony\jpda\tests\jdwp\share\JDWPUnitDebuggeeProcessWrapper.java
(at line 233)
argv.add(val);
^^^^^^^^^^^^^
Type safety: The method add(Object) belongs to the raw type Vector. References to generic
type Vector<E> should be parameterized
----------
29. WARNING in D:\cc\cc-common\build\checkouts\hdk\working_jdktools\modules\jpda\test\common\unit\org\apache\harmony\jpda\tests\jdwp\share\JDWPUnitDebuggeeProcessWrapper.java
(at line 253)
return (String[])argv.toArray(args);
^^^^^^^^^^^^^^^^^^
Type safety: The method toArray(Object[]) belongs to the raw type Vector. References to generic
type Vector<E> should be parameterized
----------
29 problems (29 warnings)
JPDA exclude list: D:\cc\cc-common\build\checkouts\hdk\working_classlib\deploy\build\jdktools.jpda.exclude
Running JPDA tests
Debugger JVM=D:\cc\cc-common\build\checkouts\hdk\target\hdk\jdk\jre/bin/java
Debuggee JVM=D:\cc\cc-common\build\checkouts\hdk\target\hdk\jdk\jre/bin/java
SAMSA exclude list: D:\cc\cc-common\build\checkouts\hdk\working_classlib\deploy\build\jdktools.samsa.exclude
Running SAMSA tests
test.jre.home=D:\cc\cc-common\build\checkouts\hdk\target\hdk\jdk\jre
Run jdk/bin/java -version in D:\cc\cc-common\build\checkouts\hdk\working_jdktools\build\test_report
java version "1.5.0"
pre-alpha : not complete or compatible
svn = r611811, (Jan 14 2008), Windows/ia32/msvc 1310, debug build
http://harmony.apache.org
Run jdk/bin/javac -version in D:\cc\cc-common\build\checkouts\hdk\working_jdktools\build\test_report
Run jdk/bin/javah in D:\cc\cc-common\build\checkouts\hdk\working_jdktools\build\test_report
Run jdk/bin/javadoc in D:\cc\cc-common\build\checkouts\hdk\working_jdktools\build\test_report
Run jdk/bin/jarsigner in D:\cc\cc-common\build\checkouts\hdk\working_jdktools\build\test_report
Run jdk/bin/keytool -help in D:\cc\cc-common\build\checkouts\hdk\working_jdktools\build\test_report
Compiling TOOLS tests
Since fork is false, ignoring memoryMaximumSize setting
----------
1. WARNING in D:\cc\cc-common\build\checkouts\hdk\working_jdktools\modules\tools\src\test\java\org\apache\harmony\tests\tools\javah\Test\Test01.java
(at line 24)
private static final long xxx2 = 1;
^^^^
The field Test01.xxx2 is never read locally
----------
1 problem (1 warning)
TOOLS exclude list: D:\cc\cc-common\build\checkouts\hdk\working_classlib\deploy\build\jdktools.tools.exclude
Running TOOLS tests
test.jre.home=D:\cc\cc-common\build\checkouts\hdk\target\hdk\jdk\jre
The test report is in D:\cc\cc-common\build\checkouts\hdk\working_jdktools\build\test_report\html\index.html
The execution FAILED with the following exception:
The following error occurred while executing this line:
D:\cc\cc-common\adaptors\jdktools-test\adaptor.xml:28: The following error occurred while
executing this line:
D:\cc\cc-common\build\checkouts\hdk\working_jdktools\build.xml:242: The following error occurred
while executing this line:
D:\cc\cc-common\build\checkouts\hdk\working_jdktools\make\build-test.xml:97: There were test
errors.

***********************************************************
Unit Tests: (160)
        
error: testOwnedMonitors001 org.apache.harmony.jpda.tests.jdwp.ThreadReference.OwnedMonitorsTest
Unit Test Error Details:	(1)
                
Test: testOwnedMonitors001Class: org.apache.harmony.jpda.tests.jdwp.ThreadReference.OwnedMonitorsTestorg.apache.harmony.jpda.tests.framework.jdwp.exceptions.ReplyErrorCodeException:
Error 20: INVALID_OBJECT
	at org.apache.harmony.jpda.tests.framework.jdwp.VmMirror.checkReply(VmMirror.java:95)
	at org.apache.harmony.jpda.tests.framework.jdwp.VmMirror.getThreadName(VmMirror.java:699)
	at org.apache.harmony.jpda.tests.jdwp.ThreadReference.OwnedMonitorsTest.testOwnedMonitors001(OwnedMonitorsTest.java:114)
	at java.lang.reflect.VMReflection.invokeMethod(VMReflection.java)

***********************************************************
Modifications since last successful build:	(1)
            
add cc-hdk log20080114202345Lbuild.481 01/14/2008 20:23:45hdk

begin 644 execution_log.zip
M4$L#! H    ( /.R+CAG=,\C_!$  '!^   2    97AE8W5T:6]N7VQO9RYH
M=&UL[5U]4^,\DO\;JN8[:)^MJX4J8O+&6S;#%0?,#O,, T<8GKN:S%'"5A*#
M8WDEFY"=>K[[=4MV$MN)$T ,86I3,Y0M2ZU6_[I;[;8L-WMAW]MOWG!GN-\,
M!-MO4B+#H<?>_ZW#_; DW7^Q!MDM_\??_[;_;C4*'!JRDKSW&^]6WZV6) NC
MH'3KW(6<>[(TD+HXKI8M%Q$V.XH"S[7AND,"P6^9'1*?]AEQ?>+V RY"BYS'
MY9<\*'UF]\S#F@$3X9 XK./Z;NAR7^IC(--QA0RQ_5&C;=OPKV3S?I_[;6D+
M-PAE.V[M,FD]]#U"?8?0+L4.\VUN(M=SVG:/V7<\@K8]YZX]X.+.];O7R8#:
M?7K',E1Q@"&3(8R0X.\;LWO\.UE]O^!O]1(:0R<DZ83<N#X52-VR%J>";-@>
MHWX)F9$E&$,0A4K\-@^&I5O!2AW78QH1N]?G3K8LKM9(1E2".I&^J@;6OW-<
M\9T<"J9 A)/&TZ2H*V$7UX(A\B_7@<3!J%,MEPQ*A[P?N!Y*_]/YT0&)6[P8
M,VW;HU*RI(M;>D_M22:J.Q4B>21L1A0N).0OU&?+];$3:$=<23K4DVR#N%V?
M"^2CS_I<#$_I@]N/^BWP! 0,'I4T3:0T^J7+*Q;YX^#BR\F7?SS=T+3JM6_!
MHZAQM./6$3B!-A?=-@THT&CWJ(#BX;BB;'<$N!6DV#YB-U&WR]@%Z[HR9,)"
M!M.\DC4:$A ^(UN[Z^E+*R)NQAR+.LZ:$U-;_SO)5/R_&;]TM<MA (*D'18.
M&^2RQT#,88^#2P+:9S?H^-;)#?.XWU7 AU!#T $)L=EGU[]CSF=@QR(7K ,\
M 7ZJ6I?Y3+AVMEKS>)_('H\\!VB2@*),8"B I;,8B+/*J\L"+OK-LT#-",6X
MEK>RP+H^B,*GWOG8DX.S7,/I:(/<4R\"C!>$^-%H8T<:[0TR#_6/5/9.:5 (
M>5RG^?O&U0LA7EL6Q&^=0= ^I_8="X]<&= 06A3;=*52SV(/884?_G?$(J:,
M6IUJFH_!W*1ES[5I ]9<?[L85NM[><<,H61BM&Q 3L">NTRL8?E0$[>Z+#QQ
MUM;7-S)TY_PF2#S%!SSU]S*^(Z0W'IOK/50M _YCZPWKV&[.3V#'<,.@E>S$
MV2!QP>):\2M@NOUV,:UMY>;]?V-:5+ZS5%A?]4]=(?B<^7VWEC-<14>JR5T=
MS@?7W&1^( 0=SIW11[6>/:WOOD'(]LK5+&3W5&C X* 8KK<+U=[;@ZI:J>:@
MZKC,<S18,H*;IT/,+GS0A2%7XEI;_^9^?WKP]'8AKI3?(L:U(HS5X:_L06=B
M^<I)+(5@G+\29_X1PSBE?>:#( =)\6<:^78O27(5PKR7CV_1<,GQ@\U4#N4#
M%PE9PAY"!E'2^"+YD6FL[Y46L-X>I@Z%2SWW7QB]D()>'0Y ^SPD#H-:@A%\
M($%#@+SC^M2+Z5PQ(:'AUY,CHG23\(Y6"52G9T+^RJDM!?DQYB-D6[G5K[['
MJ;,0OGDCUL]4")Y:4>AZUC@WF#5G\A@X"^AB*MEG]X!E)!?VF:^<77J.T/=V
MLD*_ 7X8]4$09U%XUCE5>73R7B?89XB=S!&XQVW0?HB,7&5!:=(CB0M&%Y7X
M*^>"GB/QRDXE*_(@NO' 1RA*! FIH[56J)YD8$IW'688P0=2U_G"PP\\\IUY
MSHTL,K$)%D;"UPY(<]#A(L?%.ND(WE?SW+AF9M2'D0QY_S,4 9@^8^!^T;D#
M"LR!VU3_7OL]G GA#'KIXZ&BU/S/_6D=:%H+ZL0KYVZ>IQ.Y_&!*)V#V6 *=
MR'*Q_#HQ4U=>.2>4TA7>O\&E /JT7*[B0Z%B;2F79SEM]A! :'K(T>&&"4UP
MWFO8+W-.51#;"JF .@X[\1WV0-Z_)Y-7CP'DY%HN:I[J[Q?V^].Y>X+_GXGK
M*^=_BG"MS<5UJY9S L*]!TF1$;Q(*X;IP0TOF,W<>S"D.;-S(6K3<--AZ?01
MS.(A!:-&WALN"-LKYX">!]O.]I1GL^3X?\Z/#R^/CZZ/KXZ_7+:N#\^^?KD$
MH++E!Q<7!_]K><SOAKUI^#W-TJ;W;M+27CD7-!NRN7CEGY/\0GA57SE_\PQ<
MJI7\#> O!,PR)&.>!DRMGEM6]"L!LTPID\<!LY-/F<3W!QWJ>I%@ITQ*VF4 
MRF]__2OY<'#R^>O%,7$B54>-"0_4C"[_0O[RVT)9E;G09#I_"B;+E%%YY.R2
M3U,^'9,E@F0F5,N4BLE!=4CEG#OO6NX).V9AXW1_]DY)M;E$B5[@&AM<H/.%
M/817N-SN .Y,_>[:]%NF)[FXJ3P\Q9J6*3/R!(AV<SG*(HC$&T)F)F)+E)\8
M)93FYR5V<W&" DH]TSLYFH'-!WVU&)[Y#B[NPR0(RY!,N.SA0$:/$=M*6O-G
MH?I6+D4TL:8$UQLJ0C S17:X%@MO X6ZO@Q/O:_@*A>%CT]UE9=;(KX,*0D)
M%UC[T]$?YU^A19)3/1<<!"+_$#0(YJT)K.522E1T[^-U*M[/6J?R\^"L+D-:
MXOFPY3.!<48^SKQ_^[ZN<$Q6J\")G)FK'?V>:K%)+QIFZ'LI@,;WZL#S]R59
M@Y,!%3X(1J[CRU(!S#, 08D]V%[DL,P+4^HUJ?@2R%N&CWLI2CW^]]R;M@.3
M&1_&=1/ML5 9K)AZ_.+@U->V+B+?G_;25G*=D-&J@D]7I^\7X1#"$9A:U>$M
M_A=L$V*MS;&FY6@S<[2_W:)YC,<%=F)I.[%B.]&B44.UT$ZL*U>$$?5.H1)H
MO14OB\"Y+4T22R3!-S!)98-\T+<RLD'*&^08%P?IPTNWSPCS:""9TR#;5GUW
MBTAF/Y_4EE6MU4V1*F]7C9':,\95I;QGC*OZSC(.<*=8[+5%256VK-I.L6)5
M%Z95MJK;QI2TO+-K3%KUBC%IE6O%M.J+TJIM6]N[!G6K9HQ49=L4J6US=EBO
M%FO\]L)RKX+&%QOB8S3>I'\PYTNWYFCIXJ1,<52K&C/G>4YF81.LEJU*U=Q4
MN'0R-S;AU*V][:6<4>O&7)4Q] S*RJC8=^JF2"V?(ACSY@:]U$YE&;7 I)J;
MNR$I5Y8Q;%Q&EV!(3DNK4TLF)Z/1L$G5-,:5.6^P?(&462TW)7*#L@)2-4,Z
M!:2V#-U"FAV@P6#*W(1E+*-0G4_K=4+KRI8QOS<OP?0H;3#H0LUQ53,D=H,Z
M:M(C%Y+9>H2JURJ&,AQFYYLG:D)ET:GKN'6YR/.#S+-QZVS@,^>4 PWH#OE1
MJZN.C\SD4 R9=\4@%!6#[MZ4=5<,SOS%9!:^3]TS-U7/3Z8]:E(T-_F82Q'-
M481'Y7KG)&@?16M.;F[Q9Q([UJZIK(7)"7:IR"S?P S&VU5S1EPW=Y.ZI+&,
M53'UT,ULW&=*/0W?7<X<X+10Y.EK)3YR;V()[?-9W[.V#0EA>\=<YMR@IS9+
MJFY(6$!J:_F>$P&$>V5#K@A(S7D0_1A2>X:$A4IJ:@I0M,SI@RDMW3;WL&][
MPMV^6PUY9/=*\0LE4FV^WAB7,T5DHI2--F%OS%^:USHX;;W@VCQ)^W)B<1[V
M:W/?IB"7+QRZ=?4N]GK?<MQIW^?$9_AJ/ G90[A!'*XV7^!A3VTD/G]UGQZ0
MJI&N@$76K0"'S_OLB2OP<EWB_ONC97FDE.RM\-2%L#/VN(<.'YC]G1RH&8M\
MU#,6T3LY,4$:9,U>)X<\& JWVPM)96\/5*U:+N^H1:5QLQ;OA /<(DGM6D'5
MCA5<$!>TTW-MYDM0HPU" 8= ?7,!=Y=,]Z\&F8SQMXH%'O WDJX"VE:B7M"C
MP!1NRP2C#SP6,NP)CZ%;H)MN(^]]?%-ANU+9K0#?:Y^H#S?:R/_N^@;YP_4=
M/I";+JU5-_ORWB:56@4L1FVL3I3$TN1Z81@T-C>3>3V>YF'&+T;/?G'XCFW/
M!?LFGU",>O]^ *]L[>S J&M6S8)1C4$\^:]3.!,!RJ&LT;3(@><1=1D\"I-,
MW#/'*AY6[Z5&\^G+24E]^X/TF-IK1!NQ6GI,<4URNGKZ["N^%->8%H;%:WJ1
M<^L4O[KQC>OMVK^3IMX'#'=BD?M%U$=-TL6$E&XX#Q454,0>:>+??64C71=B
M.Z)*!RX(&==(PZB9[Z KXEE"TW^X,MMA'1IY8;QG&1(L% 3PE.,'?S-XPI7L
M/X$E3IJ(YGZ*%.H>DM,?"1FQ))CC"F:CRW;]Q[ E V:['5=]DB7G:G(L.:2I
M^^%B..(K82FE@0EC=OP1#M"A5'>+<3CJC QZKMW+4^V Y]0O/^%+!E0,YXW 
M]<$RLMV<J,+X:QL3JJ?>7(!N:!3R/CA-M;?'O![ ?]UP<#!9V'#+(A'/C^@!
MX"YF'K\I6YNDIF($M7\>[EH2 5?DGW";I(&<:+28E"7&)DJ>-T/<N@]\0583
M+I@$Y87@J=C/.=Q^,4\'Y(^0O-YIT,49#64(7 ]96,063"==Q/?%&!,MW4&/
M>8$US<6NC)GX$7O%/\FG@PL5+Q+ C6:0FFB ^N1VAE,:%FE.W&H%?B0F , B
M10?;DWS[TAT;2C U1IK)T;7RA"OJG4,=J&B%2ZYG"*@R];++F *> @55ND#K
M #5WLG\I 0X'*(RX2\KRW(\:3[1;(<E>0E ^:DO6P'$X;J<#H8;>:VM*G^M9
M!I7T !CMEJ_1P+ #]26L>&S%$H:K"O#I[:W6!Q5\6T<0.BLGFH=4.985-2I^
M[\*] G4<]64MZL4S0JY+#VPDW02&S ;)! )G 9<R'P^6;"8@P%$:Y+@R\.B0
M8!'X&-S%2I*U"'@9N# O)BJ*W"=<9J472DJ:EZV#ZZ\7G_>19DJIX+X+%(#V
M W2U/2[<<)AOC[UK&GATK<QF4C-408($5)MD-T,-9/$P),T>!YL&$4(4)_=_
M-)IHW/M_*E'!9179@55#)1)74D/$6AN$65U+5[1T10M\2J-2K=6G]:7- O^.
M<)^TB52':Q\O+\\Q5&^='?[>R@HRAE%H+Z]G""0W]OI(U!;#(.1=00.8-Q5A
MN+E(5$#,(*D:-Q/^DE)%,VMM<CH;C^)";:[7IS[MXI0XPRV,>TIS-_8'!6R"
MP9GB$V<%K>UHXS3$),#LWM*\CEH4,HO::I[;29,MZ'"2X<DVA1SW'?/\]N.M
M.ARWF\H>9'M,2SC=:@;3N=  = AG>%+"B?NEPH/TV>]QEY&*"]+7$G9^E)KQ
MQRVTK_ASLD1' 5C6U(?7ZJ-7^W]:ED5*GYH8A265"AGQ^<!//J(A,YRL*-T0
M[)\K*__0=Y(LI11P)1KEWR<:H:!LX:VL'.)1>KH0[#[Q^+@W=)2->$IZ5\P0
M&NN#L8F''/PN#WM:62 0SS9U&&8W8%:Y8'U^SPA,>7#+H";VZ6YEI<0>$"IH
M<JP.4L/#_M0,C$Y8A@[/3JLK);C!!LK0O,7@7D3QBI5UD.&*Y 8<1IMMB;H&
M[2Y[$,@JO4MTE^L DH" : ),MK'>P1F:G^BMG&F*[S6[!_?JZTB)DL/6A=YW
M(DL#>+0][H.X1I_UA.K(N1+;E.HJ)'(05>IWTY%4MC9$6WYH*QC/\1!EJ268
MX56!DX^15DJ2>1U-8*1Z$+E"81R I:@HES%*8 )C.6I)5)GFORB47!G'SE=)
MY#S9IQ)RD6E]1!2+#%S[FQ\9*\^DJ2"\:*QDFFBMR_:=SS8O\M7,R[.SSZW4
M9S/C5\S'5;;^_47+U,X(^DP*6V^/@!U,VQ=!CU175BDT];U#]:=<F?.]M%D[
MH::VTU>[RSP\/%3)>U*9N_W!Z#=]0QF]YVG,G"+ZG!U-D]T)R%HEV9M@@:T)
MM"Z^V/,/_?=G/O_(&9?YYQ\+/$P?CQYW^Y?Q<W4(05KH_O2&TBT*2!<^3%]X
MM5)M[LNWCWDMJER\ZF5AKB9>O7WN0SP=X)3 4958/PB'NC!.$TX4Y4LP15?2
MT2&<Z^'H4QB4H+[4.X #XPU2WZZ4^QFU04-%;HANA"9J+%QMX^?$VR[NY67A
M(?(KX1X\'#/\;A5FGLE3+0@E'Z$S@^]65Y%)G),B%>3IA1]ZAE992HXI4+7'
M7[*S5D,UF;B \B?<MB,AP/8&/=<;483+(89,Z"?QB^29H5.'!KC\=63TBKFD
M&#_VW:CNZMU=C/2WN*AUW_7JS^Y<?>]\' @H-O9V%!<0^@SPC](HK?06@-K<
MI/O-3?5!^4W]<?E-]:7Y_P=02P$"% ,*    " #SLBXX9W3/(_P1  !P?@  
M$@              I($     97AE8W5T:6]N7VQO9RYH=&UL4$L%!@     !
-  $ 0    "P2      $! 
end


Mime
View raw message