harmony-alerts mailing list archives

Site index · List index
Message view « Date » · « Thread »
Top « Date » · « Thread »
From nom...@intel.com
Subject [build-test alert] FAILED Windows 2003 x86: jdktools-test debug
Date Fri, 11 Jan 2008 18:37:13 GMT

BUILD FAILED:
	Ant Error Message:
D:\cc\cc-common\scripts\cc-exec-adaptor.xml:104: The following error occurred while executing
this line: D:\cc\cc-common\adaptors\jdktools-test\adaptor.xml:28: The following error occurred
while executing this line: D:\cc\cc-common\build\checkouts\hdk\working_jdktools\build.xml:242:
The following error occurred while executing this line: D:\cc\cc-common\build\checkouts\hdk\working_jdktools\make\build-test.xml:97:
There were test errors.

Date of build:	2008-01-12 00:16:07 +0600
Time to build:	20 minutes 58 seconds
Last changed:	01/11/2008 23:36:04
Last log entry:	hdk

***********************************************************
Errors/Warnings:	(229)
            
Result: 1
[cc-ant]: Test Suite 'jdktools-test' execution. Repository updated: ${repository.updated}
[cc-ant]: Check for 'run' failure of hdk = ${hdk.parameters.run.failed}
[cc-ant]: Result: failed.superiors = '${failed.superiors}'
========================================
Testing jdktools binaries...
========================================
Compiling JPDA tests
Since fork is false, ignoring memoryMaximumSize setting
----------
1. WARNING in D:\cc\cc-common\build\checkouts\hdk\working_jdktools\modules\jpda\test\common\unit\org\apache\harmony\jpda\tests\framework\DebuggeeRegister.java
(at line 58)
registered.add(debuggee);
^^^^^^^^^^^^^^^^^^^^^^^^
Type safety: The method add(Object) belongs to the raw type LinkedList. References to generic
type LinkedList<E> should be parameterized
----------
----------
2. WARNING in D:\cc\cc-common\build\checkouts\hdk\working_jdktools\modules\jpda\test\common\unit\org\apache\harmony\jpda\tests\framework\TestOptions.java
(at line 505)
internalProperties.put(name, value);
^^^^^^^^^^^^^^^^^^^^^^^^^^^^^^^^^^^
Type safety: The method put(Object, Object) belongs to the raw type HashMap. References to
generic type HashMap<K,V> should be parameterized
----------
----------
3. WARNING in D:\cc\cc-common\build\checkouts\hdk\working_jdktools\modules\jpda\test\common\unit\org\apache\harmony\jpda\tests\framework\jdwp\PacketDispatcher.java
(at line 114)
eventQueue.add(eventPacket);
^^^^^^^^^^^^^^^^^^^^^^^^^^^
Type safety: The method add(Object) belongs to the raw type List. References to generic type
List<E> should be parameterized
----------
4. WARNING in D:\cc\cc-common\build\checkouts\hdk\working_jdktools\modules\jpda\test\common\unit\org\apache\harmony\jpda\tests\framework\jdwp\PacketDispatcher.java
(at line 249)
replies.put(new Integer(replyPacket.getId()),
replyPacket);
^^^^^^^^^^^^^^^^^^^^^^^^^^^^^^^^^^^^^^^^^^^^^^^^^^^^^^^^^^^^^^^^^^^^^^^^^^^^^^^^^^^^^^^^^^^
Type safety: The method put(Object, Object) belongs to the raw type Hashtable. References
to generic type Hashtable<K,V> should be parameterized
----------
5. WARNING in D:\cc\cc-common\build\checkouts\hdk\working_jdktools\modules\jpda\test\common\unit\org\apache\harmony\jpda\tests\framework\jdwp\PacketDispatcher.java
(at line 284)
commands.put(Id, command);
^^^^^^^^^^^^^^^^^^^^^^^^^
Type safety: The method put(Object, Object) belongs to the raw type Hashtable. References
to generic type Hashtable<K,V> should be parameterized
----------
6. WARNING in D:\cc\cc-common\build\checkouts\hdk\working_jdktools\modules\jpda\test\common\unit\org\apache\harmony\jpda\tests\framework\jdwp\PacketDispatcher.java
(at line 355)
commands.put(Id, command);
^^^^^^^^^^^^^^^^^^^^^^^^^
Type safety: The method put(Object, Object) belongs to the raw type Hashtable. References
to generic type Hashtable<K,V> should be parameterized
----------
----------
7. WARNING in D:\cc\cc-common\build\checkouts\hdk\working_jdktools\modules\jpda\test\common\unit\org\apache\harmony\jpda\tests\framework\jdwp\VmMirror.java
(at line 1834)
frames.add(frame);
^^^^^^^^^^^^^^^^^
Type safety: The method add(Object) belongs to the raw type ArrayList. References to generic
type ArrayList<E> should be parameterized
----------
8. WARNING in D:\cc\cc-common\build\checkouts\hdk\working_jdktools\modules\jpda\test\common\unit\org\apache\harmony\jpda\tests\framework\jdwp\VmMirror.java
(at line 1902)
vars.add(var);
^^^^^^^^^^^^^
Type safety: The method add(Object) belongs to the raw type ArrayList. References to generic
type ArrayList<E> should be parameterized
----------
9. WARNING in D:\cc\cc-common\build\checkouts\hdk\working_jdktools\modules\jpda\test\common\unit\org\apache\harmony\jpda\tests\framework\jdwp\VmMirror.java
(at line 2122)
fields.add(superClassFields.toArray()[i]);
^^^^^^^^^^^^^^^^^^^^^^^^^^^^^^^^^^^^^^^^^
Type safety: The method add(Object) belongs to the raw type ArrayList. References to generic
type ArrayList<E> should be parameterized
----------
10. WARNING in D:\cc\cc-common\build\checkouts\hdk\working_jdktools\modules\jpda\test\common\unit\org\apache\harmony\jpda\tests\framework\jdwp\VmMirror.java
(at line 2132)
fields.add(field);
^^^^^^^^^^^^^^^^^
Type safety: The method add(Object) belongs to the raw type ArrayList. References to generic
type ArrayList<E> should be parameterized
----------
----------
11. WARNING in D:\cc\cc-common\build\checkouts\hdk\working_jdktools\modules\jpda\test\common\unit\org\apache\harmony\jpda\tests\jdwp\DebuggerOnDemand\OnthowDebuggerLaunchDebuggee.java
(at line 94)
class ExceptionForDebugger extends Exception {
^^^^^^^^^^^^^^^^^^^^
The serializable class ExceptionForDebugger does not declare a static final serialVersionUID
field of type long
----------
----------
12. WARNING in D:\cc\cc-common\build\checkouts\hdk\working_jdktools\modules\jpda\test\common\unit\org\apache\harmony\jpda\tests\jdwp\Events\ClassUnloadDebuggee.java
(at line 32)
import java.util.LinkedList;
^^^^^^^^^^^^^^^^^^^^
The import java.util.LinkedList is never used
----------
13. WARNING in D:\cc\cc-common\build\checkouts\hdk\working_jdktools\modules\jpda\test\common\unit\org\apache\harmony\jpda\tests\jdwp\Events\ClassUnloadDebuggee.java
(at line 97)
boolean isOutOfMemory = false;
^^^^^^^^^^^^^
The local variable isOutOfMemory is never read
----------
14. WARNING in D:\cc\cc-common\build\checkouts\hdk\working_jdktools\modules\jpda\test\common\unit\org\apache\harmony\jpda\tests\jdwp\Events\ClassUnloadDebuggee.java
(at line 171)
public Class loadClass(String name) throws ClassNotFoundException {
^^^^^
Type safety: The return type Class for loadClass(String) from the type ClassUnloadDebuggee.CustomLoader
needs unchecked conversion to conform to Class<?> from the type ClassLoader
----------
15. WARNING in D:\cc\cc-common\build\checkouts\hdk\working_jdktools\modules\jpda\test\common\unit\org\apache\harmony\jpda\tests\jdwp\Events\ClassUnloadDebuggee.java
(at line 179)
public Class findClass(String name) throws ClassNotFoundException {
^^^^^
Type safety: The return type Class for findClass(String) from the type ClassUnloadDebuggee.CustomLoader
needs unchecked conversion to conform to Class<?> from the type ClassLoader
----------
----------
16. WARNING in D:\cc\cc-common\build\checkouts\hdk\working_jdktools\modules\jpda\test\common\unit\org\apache\harmony\jpda\tests\jdwp\Events\CombinedEvents002Test.java
(at line 100)
boolean expectColocatedEvents = (testedMethodStartCodeIndex == testedMethodEndCodeIndex);
^^^^^^^^^^^^^^^^^^^^^
The local variable expectColocatedEvents is never read
----------
----------
17. WARNING in D:\cc\cc-common\build\checkouts\hdk\working_jdktools\modules\jpda\test\common\unit\org\apache\harmony\jpda\tests\jdwp\Events\CombinedEvents003Test.java
(at line 53)
private boolean eventMethodExitReceived = false;
^^^^^^^^^^^^^^^^^^^^^^^
The field CombinedEvents003Test.eventMethodExitReceived is never read locally
----------
18. WARNING in D:\cc\cc-common\build\checkouts\hdk\working_jdktools\modules\jpda\test\common\unit\org\apache\harmony\jpda\tests\jdwp\Events\CombinedEvents003Test.java
(at line 76)
int EXPECTED_EVENTS_COUNT = EXPECTED_EVENTS_ARRAY.length;
^^^^^^^^^^^^^^^^^^^^^
The local variable EXPECTED_EVENTS_COUNT is never read
----------
----------
19. WARNING in D:\cc\cc-common\build\checkouts\hdk\working_jdktools\modules\jpda\test\common\unit\org\apache\harmony\jpda\tests\jdwp\Events\CombinedEventsTest.java
(at line 84)
int EXPECTED_EVENTS_COUNT = EXPECTED_EVENTS_ARRAY.length;
^^^^^^^^^^^^^^^^^^^^^
The local variable EXPECTED_EVENTS_COUNT is never read
----------
20. WARNING in D:\cc\cc-common\build\checkouts\hdk\working_jdktools\modules\jpda\test\common\unit\org\apache\harmony\jpda\tests\jdwp\Events\CombinedEventsTest.java
(at line 212)
int EXPECTED_EVENTS_COUNT = EXPECTED_EVENTS_ARRAY.length;
^^^^^^^^^^^^^^^^^^^^^
The local variable EXPECTED_EVENTS_COUNT is never read
----------
21. WARNING in D:\cc\cc-common\build\checkouts\hdk\working_jdktools\modules\jpda\test\common\unit\org\apache\harmony\jpda\tests\jdwp\Events\CombinedEventsTest.java
(at line 348)
int EXPECTED_EVENTS_COUNT = EXPECTED_EVENTS_ARRAY.length;
^^^^^^^^^^^^^^^^^^^^^
The local variable EXPECTED_EVENTS_COUNT is never read
----------
22. WARNING in D:\cc\cc-common\build\checkouts\hdk\working_jdktools\modules\jpda\test\common\unit\org\apache\harmony\jpda\tests\jdwp\Events\CombinedEventsTest.java
(at line 732)
String failureMessage = "## FAILURE during checking events! !";
^^^^^^^^^^^^^^
The local variable failureMessage is never read
----------
23. WARNING in D:\cc\cc-common\build\checkouts\hdk\working_jdktools\modules\jpda\test\common\unit\org\apache\harmony\jpda\tests\jdwp\Events\CombinedEventsTest.java
(at line 894)
String failureMessage = "## FAILURE during checking events !";
^^^^^^^^^^^^^^
The local variable failureMessage is never read
----------
----------
24. WARNING in D:\cc\cc-common\build\checkouts\hdk\working_jdktools\modules\jpda\test\common\unit\org\apache\harmony\jpda\tests\jdwp\Events\CombinedEventsTestCase.java
(at line 135)
long methodStartCodeIndex = lineTableReply.getNextValueAsLong();
^^^^^^^^^^^^^^^^^^^^
The local variable methodStartCodeIndex is never read
----------
25. WARNING in D:\cc\cc-common\build\checkouts\hdk\working_jdktools\modules\jpda\test\common\unit\org\apache\harmony\jpda\tests\jdwp\Events\CombinedEventsTestCase.java
(at line 187)
long methodStartCodeIndex = reply.getNextValueAsLong();
^^^^^^^^^^^^^^^^^^^^
The local variable methodStartCodeIndex is never read
----------
----------
26. WARNING in D:\cc\cc-common\build\checkouts\hdk\working_jdktools\modules\jpda\test\common\unit\org\apache\harmony\jpda\tests\jdwp\Events\ExceptionTest.java
(at line 188)
long frameID = reply.getNextValueAsFrameID();
^^^^^^^
The local variable frameID is never read
----------
----------
27. WARNING in D:\cc\cc-common\build\checkouts\hdk\working_jdktools\modules\jpda\test\common\unit\org\apache\harmony\jpda\tests\jdwp\ThreadReference\FramesTest.java
(at line 450)
frames.add(new FrameStruct(frameID, loc));
^^^^^^^^^^^^^^^^^^^^^^^^^^^^^^^^^^^^^^^^^
Type safety: The method add(Object) belongs to the raw type Vector. References to generic
type Vector<E> should be parameterized
----------
----------
28. WARNING in D:\cc\cc-common\build\checkouts\hdk\working_jdktools\modules\jpda\test\common\unit\org\apache\harmony\jpda\tests\jdwp\share\JDWPUnitDebuggeeProcessWrapper.java
(at line 233)
argv.add(val);
^^^^^^^^^^^^^
Type safety: The method add(Object) belongs to the raw type Vector. References to generic
type Vector<E> should be parameterized
----------
29. WARNING in D:\cc\cc-common\build\checkouts\hdk\working_jdktools\modules\jpda\test\common\unit\org\apache\harmony\jpda\tests\jdwp\share\JDWPUnitDebuggeeProcessWrapper.java
(at line 253)
return (String[])argv.toArray(args);
^^^^^^^^^^^^^^^^^^
Type safety: The method toArray(Object[]) belongs to the raw type Vector. References to generic
type Vector<E> should be parameterized
----------
29 problems (29 warnings)
JPDA exclude list: D:\cc\cc-common\build\checkouts\hdk\working_classlib\deploy\build\jdktools.jpda.exclude
Running JPDA tests
Debugger JVM=D:\cc\cc-common\build\checkouts\hdk\target\hdk\jdk\jre/bin/java
Debuggee JVM=D:\cc\cc-common\build\checkouts\hdk\target\hdk\jdk\jre/bin/java
SAMSA exclude list: D:\cc\cc-common\build\checkouts\hdk\working_classlib\deploy\build\jdktools.samsa.exclude
Running SAMSA tests
test.jre.home=D:\cc\cc-common\build\checkouts\hdk\target\hdk\jdk\jre
Run jdk/bin/java -version in D:\cc\cc-common\build\checkouts\hdk\working_jdktools\build\test_report
java version "1.5.0"
pre-alpha : not complete or compatible
svn = r611242, (Jan 11 2008), Windows/ia32/msvc 1310, debug build
http://harmony.apache.org
Run jdk/bin/javac -version in D:\cc\cc-common\build\checkouts\hdk\working_jdktools\build\test_report
Run jdk/bin/javah in D:\cc\cc-common\build\checkouts\hdk\working_jdktools\build\test_report
Run jdk/bin/javadoc in D:\cc\cc-common\build\checkouts\hdk\working_jdktools\build\test_report
Run jdk/bin/jarsigner in D:\cc\cc-common\build\checkouts\hdk\working_jdktools\build\test_report
Run jdk/bin/keytool -help in D:\cc\cc-common\build\checkouts\hdk\working_jdktools\build\test_report
Compiling TOOLS tests
Since fork is false, ignoring memoryMaximumSize setting
----------
1. WARNING in D:\cc\cc-common\build\checkouts\hdk\working_jdktools\modules\tools\src\test\java\org\apache\harmony\tests\tools\javah\Test\Test01.java
(at line 24)
private static final long xxx2 = 1;
^^^^
The field Test01.xxx2 is never read locally
----------
1 problem (1 warning)
TOOLS exclude list: D:\cc\cc-common\build\checkouts\hdk\working_classlib\deploy\build\jdktools.tools.exclude
Running TOOLS tests
test.jre.home=D:\cc\cc-common\build\checkouts\hdk\target\hdk\jdk\jre
The test report is in D:\cc\cc-common\build\checkouts\hdk\working_jdktools\build\test_report\html\index.html
The execution FAILED with the following exception:
The following error occurred while executing this line:
D:\cc\cc-common\adaptors\jdktools-test\adaptor.xml:28: The following error occurred while
executing this line:
D:\cc\cc-common\build\checkouts\hdk\working_jdktools\build.xml:242: The following error occurred
while executing this line:
D:\cc\cc-common\build\checkouts\hdk\working_jdktools\make\build-test.xml:97: There were test
errors.

***********************************************************
Unit Tests: (160)
        
error: testOwnedMonitors001 org.apache.harmony.jpda.tests.jdwp.ThreadReference.OwnedMonitorsTest
Unit Test Error Details:	(1)
                
Test: testOwnedMonitors001Class: org.apache.harmony.jpda.tests.jdwp.ThreadReference.OwnedMonitorsTestorg.apache.harmony.jpda.tests.framework.jdwp.exceptions.ReplyErrorCodeException:
Error 20: INVALID_OBJECT
	at org.apache.harmony.jpda.tests.framework.jdwp.VmMirror.checkReply(VmMirror.java:95)
	at org.apache.harmony.jpda.tests.framework.jdwp.VmMirror.getThreadName(VmMirror.java:699)
	at org.apache.harmony.jpda.tests.jdwp.ThreadReference.OwnedMonitorsTest.testOwnedMonitors001(OwnedMonitorsTest.java:114)
	at java.lang.reflect.VMReflection.invokeMethod(VMReflection.java)

***********************************************************
Modifications since last successful build:	(1)
            
add cc-hdk log20080111233604Lbuild.473 01/11/2008 23:36:04hdk

begin 644 execution_log.zip
M4$L#! H    ( *0$+#@T&P.,&Q(  &U^   2    97AE8W5T:6]N7VQO9RYH
M=&UL[5W_4]NZLO\99OH_Z)X[;R[,$).O!')3WO" WM)3"H_0GO>FZ>L(6TG<
M.I:O9 .YG?._OUW)3F([<4(0)71NIF5L65JM]K.[6J]EN3T(A]YA^X8[H\-V
M(-AAFQ(9CCSV^F\][H<EZ?Z+M<A^^3_^_K?#5YM1X-"0E>2MWWJU^6JS)%D8
M!:5OSO>0<T^6[J0NCJMERT6$S4ZBP'-MN.Z00/!OS Z)3X>,N#YQAP$7H44N
MX_)K'I3>LUOF8<V B7!$'-9S?3=TN2_U,9#IN4*&V/ZDU;5M^%>R^7#(_:ZT
MA1N$LANW=IFT[H<>H;Y#:)]BA_DV-Y'K.5U[P.SO/(*V ^=[]XZ+[Z[?_YH,
MJ#NDWUF&*@XP9#*$$1+\?6;V@'\AFZ^7_&U>0V/HA"2=D!O7IP*I6];R5) -
MVV/4+R$SL@1C"*)0B=_FP:CT3;!2S_681L0>#+F3+8NKM9(1E:!.I*^J@0V_
M.Z[X0HX%4R#"26LU*>I*V,57P1#YI^M XF#4J99+!J5C/@Q<#Z7_[O+DB,0M
MGHR9KNU1*5G2Q3=Z2^UI)JK-"I$\$C8C"A<2\B?JL^/ZV FT(ZXD/>I)MD/<
MOL\%\C%D0RY&Y_3>'4;##G@" @:/2IHF4AK_TN45B_QQ=/7A[,,_5C<TK7K=
M;^!1U#BZ<>L(G$"7BWZ7!A1H= =40/%H4E%V>P+<"E+LGK";J-]G[(KU71DR
M82&#:5[)%@T)")^1QOYV^M*&B)LQQZ*.L^7$U+;_3C(5_V_.+UWM>A2 (&F/
MA:,6N1XP$',XX."2@/;%#3J^;7+#/.[W%? AU!#TCH38[+WK?V?.>V#'(E>L
M!SP!?JI:G_E,N':V6OOTD,@!CSP':)* HDQ@*("ELQR(\\JKZP(N^LV+0,T(
MQ;B6&UE@71]$X5/O<N+)P5ENX72T0VZI%P'&2T+\8+2Q(XWV#EF$^ELJ!^<T
M*(0\KM/^?>?3$R%>6Q?$OSEW0?>2VM]9>.+*@(;0HMBF*Y5Z%GL(*_SPOR,6
M,674ZE33? CF)BU[H4T;L.;ZR\6P6C_(.V8()1.C97?D#.RYS\06EH\T<:O/
MPC-G:WM[)T-WP6^*Q"H^8-7?T_B.D-YX;*'W4+4,^(_&"]:Q_9R?P([AAD$K
MV9FS0^*"Y;7B5\!T[^5B6FODYOU_8UI4WEPKK#\-SUTA^(+Y?;^6,UQ%1ZK)
M71TN!M?<9'XD!!TMG-''M1X]K>^_0,@.RM4L9+=4:,#@H!BNEPO5P<N#JEJI
MYJ#JN<QS-%@R@ING8\PNO-&%(5?BVMK^['Y9/7AZN1!7RB\1XUH1QNKP5_:@
M<[%\YB260C#.7XD+_X1AG-*]\$&0=TGQ>QKY]B!)<A7"?)"/;]%PR>F]S50.
MY0T7"5G"[D,&4=+D(OF1::SOE9:PW@&F#H5+/?=?&+V0@EX=#D#[/"0.@UJ"
M$7P@04. O.?ZU(OI?&)"0L./9R=$Z2;A/:T2J$Z/A/R94UL*\E/,1\BN<JL?
M?8]39RE\\T:LGZD0/+6BT/6L26XP:\[D(7 6T,54LL]N <M(+NTSGSF[]!BA
M'S2S0K\!?ACU01 747C1.U=Y=/):)]CGB)TL$+C';=!^B(Q<94%ITF.)"T:7
ME?@SYX(>(_%*LY(5>1#=>. C%"6"A-315B=43S(PI;L-,XS@=U+7^<##-SSR
MG47.C2PSL0D61L+7#DAST.,BQ\4VZ0D^5//<I&9FU,>1#/GP/10!F#YCX'[1
MN0,*S(';5/]6^SV<">$,>AGBH:+4_L_#61UH6DOJQ#/G;AZG$[G\8$HG8/98
M YW(<K'^.C%75YXY)Y32%3Z\P:4 ^K1<KN)#H6)M*9?G.6UV'T!H>LS1X88)
M37#>6]@O<\Y5$-L)J8 Z#COS'79/7K\FTU=/ >3D6BYJGNGOE_;[L[E;P?_/
MQ?69\S]%N-86XMJHY9R <&]!4F0,+]**8;IWPRMF,_<6#&G![%R(VBS<=%@Z
M>P3S>$C!J)'W1DO"]LPYH,?!UMR;\6R6G/[/Y>GQ]>G)U]-/IQ^N.U^/+SY^
MN :@LN5'5U='_VMYS.^'@UGXK69ILWLW:6G/G N:#]E"O/+/27XAO*K/G+]Y
M!"[52OX&\!<"9AV2,:L!4ZOGEA7]2L"L4\KD8< T\RF3^/Z@1UTO$NR<24G[
M#$#Y[:]_)6^.SMY_O#HE3J3JJ#'A@9K1Y5_(7WY;*JNR$)I,YZM@LDX9E0?.
M+ODTY>J8K!$D<Z%:IU1,#JIC*A?<>==R3]@Q"QNG^[-W2JK--4KT"M?8X *=
M#^P^_(3+[8[@SM3O;\V^95K)Q<WD815K6J?,R H0[>=RE$40B1>$S%S$UB@_
M,4XH+<Y+[.?B! 64>J9W=C('FS?Z:C$\BQU<W(=)$-8AF7 ]P(&,'R-VE;06
MST+U1BY%-+6F!-<;*D(P,T5VN!4+;P>%NKT.3[T_P54N"A^?ZBI/MT1\'5(2
M$BZP[KN3/RX_0HLDIWHI. A$_B%H$"Q:$UC+I92HZ-_&ZU2\G[5.Y>?!65V'
MM,3C8<MG N.,?)QY__QE6^&8K%:!$SDW5SO^K6JQ22\:9NA[+8#&]^K \P\E
MV8*3.RI\$(S<QI>E IAG ((2N[>]R&&9%Z;4:U+Q)9"W#!_V4I1Z_.^Y-UT'
M)C,^BNLFVF.A,E@Q]?C%P9FO;5U%OC_KI:WD.B'C507O/IV_7H9#"$=@:E6'
MW_"_8+L0:^U.-"U'FYFC_?D;FL=D7& GEK83*[83+1HU5 OMQ/KDBC"BWCE4
M JVWXF41.+>E26*))/@&)JGLD#?Z5D:V2'F'G.+B('UX[0X981X-)'-:9,]J
M'-2(9/;C236L<F7/&*GFOC%2>U53I"KUBC&N#NIK2*K:**146Y92I6'5&\5Z
M55V:5MFJ[IE3+'/:4"T7CW!Y:=6M@_UBR=>7I57;LYK[YK2TWC1$RA1'>^4#
M4Z3J>\6D]I:6>=6JUHMI/43;R[4UQ _F"7,.R]P\4:N8,^?]8E)+FV 5(&P:
MDCMZ!E-R-P>?(5(PN 4F^ R#,Z7F.#A#,0R0JID+ATRAU[":!E7*W 1ORN4M
MGI0?%,(<&!MATU0TM%Z.9;&\GT?+RTUC$8>QX-.@YUQ/L1ODRN 4"J0.S"F#
MN=C,X$V-,4]L%D%C<0)$U^MG@V;%;M S&"1E*H(Q&0RMG:8WK,I^\>"63BI4
M%V9SGB?%5#''5;UJT)3-!=BF;M_-WD$8'&#=5"A;2*;Q$$T_6+_[;714JW%5
M65:I3CO7RSQ R#P<MR[N?.:<<Z !W2$_:GG5Z8F1+$K-D'E7#$9(2R18'\#7
M>M%I6/N&4H\')M,,U8JQV*C2-)8/-4AJ4<3VH(SO@F=P#Z%E+("H-%=V8$\=
M2IJ[<3)XO[K@>=<+3OE6S3V JUL5<P]P?F*JSV $_QRW)^8>W1@,;N<;S*QP
M9/4%$V^Y-[6.]O&L'U@-4ZL3]IK6_H+I>VE:37/3=W-13/$ 2DU3H;E!4H8L
M"]&K&AO=0=60:0&ILB&N]@RRA=)J&%-08T' GKEI9"_6JU>;(8_L02E^FT2J
MG==;DW*F"$R5LO$.[*W%Z_(Z1^>=)UR8)^E03JW,PWYM[ML49/*!0[>NWL)>
M;UJ.V^S[G/@,WXLG(;L/=XC#U<X+/!RH7<07+^W3 U(UTA6PR/HFP-'S(5MQ
M^5VN2]Q\?[PFCY22C156704[9X-[Z/">V5_(D9JIR%L]4Q&]C1,3I$6V[&UR
MS(.1</N#D%0.#D#-JF4P7%Q1&C?K\%YXA_LCJ2TKJ-JN@@OB@F9ZKLU\"6JT
M0RC@$*@/+N#6DNG^U2"3,?Y6L6 &_XVDJX"VE:@7#"@PA7LRP>@#CX4,>\)C
MZ!;HIMO(6Q]?4]BK5*IUN#G9>D=]4JD@__O;.^0/UW?XG=QU::VZ.Y2W-JG4
M*F M:E=UHB26)C<(PZ"UNYO,Y_'T#C-],7KVD\-W:GLNV#9YAV+4F_<#>&6K
MV02T:E;-@E%-0#S[KW,X$P'*H:S1M,B1YQ%U&;P)DTS<,L<J'M;@J4;S[L-9
M27WX@PR8VFA$&[%:=TQQ07*Z>OKL([X1UYH5?L4+>I%SZQP_N?&9Z[W:OY"V
MW@0,MV&1AT74QTW2Q824;C@/%150Q %IX]]#92-]%V(ZHDKO7! R+I"&43/?
M05?$LX1F_W!9ML-Z-/+">,,R)%@H". IQP_^YO"$R]A_ DN<M!'-PQ0IU#TD
MI[\0,F9),,<5S$:7[?H/84L&S'9[KOH>2\[5Y%AR2%OWP\5HS%?"4DH#$\;L
M^ L<H$.I[I;C<-P9N1NX]B!/M0>>4[_YA&\84#%:- +7!\O(=G.F"N-/;4RI
MGGIM ;JA4<B'X#35QAZ+>@#_=</!P61AP_V*1#P_H@> NY=%_*9L;9J:BA'4
MYGFX94D$7)%_PNV1!G*JT7)2EAB;*'G>C'#?/O %64VX8A*4%P*G8C_G</O)
M/!V0/T'R>IM!%V<TE"%P/6)A$5LPG?01WR=C3'1T!P/F!=8L%[LQ8>)'[!7_
M).^.KE2\2  WFD%JJ@'JD]L;S6A8I#EQJPWXD9@  (L4'6Q/\NU+W]E(@JDQ
MTDZ.OBI/N*%>.-2!BE:XY'J&@"I3;[I,*. I4%"E2[0.4'.G^Y<2X'" PIB[
MI"S/_;CQ5+L-DFPD!.7CMF0+'(?C]GH0:NB-MF;TN9UE4$D/@-%N^2L:&':@
M/H,5CZU8PG!5 3Z[O=5YHX)OZP1"9^5$\Y JQ[*A1L5O7;A7H(ZC/JM%O7A&
MR'7I@8VDF\"0V5TR@<!9P*7,QX,EFPD(<)0&.:X,/#HB6 0^!K>PDF0K E[N
M7)@7$Q5%[A,NL](+)27MZ\[1UX]7[P^19DJIX)X+%( . W2U R[<<)1OC[UK
M&GCT59G-M&:H@@0)J#;-;H8:R.)^1-H##C8-(H0H3A[^:+71N __5**"RRJR
M ZN&2B2NI(:(M78(L_J6KFCIBA;XE%:E6JO/ZDN;!?X=XSYM$ZD.M]Y>7U]B
MJ-ZY./Z]DQ5D#*/07E[/$$ANXO61J"U&0<C[@@8P;RK"<'.1J("80U(U;B?\
M):6*9M;:Y&PV'L2%VEEO2'W:QREQCEN8])3F;N(/"M@$@S/%)\X*6MO1QFF(
M28#YO:5Y';<H9!:UU3RWTR9;T.$TP]-M"CD>.N;Y'<;[=#AN/Y4]R/:8EG"Z
MU1RF<Z$!Z!#.\*2$$_=3A0?IL]_C+B,5%Z2O)>S\*+7C+UMH7_'G=(F. K"L
MK0^_JB]>'?YI618IO6MC%)94*F3$YW=^\@4-F>%D0^F&8/_<V/B'OI-D*:6 
M*]$X[S[5" 5E"V]CXQB/TM.%8+>)Q\>-H:-LQ%/26V*&T%@?3$P\Y.!W>3C0
MR@*!>+:IPS"[ ;/*%1OR6T9@RH-;!C6QSW8K&R5VCU!!DU-UD!H>]J=F8'3"
M,G1X=EK=*,$--E"&YAT&]R**5ZRL@PQ7)#?@,-IL2]0U:'<]@$!6Z5VBNUP'
MD 0$1!-@LHWU]LW0_$SOXTQ3?&_9 [A7WT9*E!QWKO2F$UD:P*/M<1_$-?ZF
M)U1'SI789E17(9&#J%*_GXZDLK4AVO)#6\%XB8<H2RW!#*\*G'R,M%&2S.MI
M F/5@\@5"N, +$5%N8QQ A,8RU%+HLHT_T6AY,8D=OZ41,[3?2HA%YG66T2Q
MR,"UO_F1L?),F@K"B]9&IHG6NFS?^6SS,I_,O+ZX>-])?3,S?K]\4J7Q[\]9
MIK9%T&=2V'IO!.Q@UJ8(>J2ZLDJAJ8\=JC_ERH*/I<W;!C6UE[[:6N;^_KY*
M7I/*PKT/QK_9N\GH#4]CYA31QVQGFFQ-0+8JR<8$2^Q+H'7QR9Y_Z+\_\_E'
MSKC,/_]8XB'Z9/2XU;^,GZ=#"-)!]Z=WD^Y00+KP(?K2*Y5J5MW4@\7&0E)+
M<U6>/ Q\[$,\'>"4P%&5V# (1[HP3A-.%>5+,$57TM$AG.OAZ%,8E*"^U-M_
M ^,M4M_;;PXS:H.&BMP0W0A-U%BXVL5OB7==W,C+PD/D5\(]>#AA^-4FS#S3
MIUH02CY"9P9?;6XBDS@G12K(TPL^] RMLI0<4Z!J@[]D6ZV6:C)U >5/N&U'
M0H#MW0U<;TP1+H<8,J&?Q,^19X9.'1K@TM>QT2OFDF+\TG>KNJ^W=C'2W_*B
MUGW7JS^[<_6Q\TD@H-@X:"HN(/2YPS]*H[326P!J>Y<>MG?5U^1W]9?E=]5G
MYO\?4$L! A0#"@    @ I 0L.#0; XP;$@  ;7X  !(              *2!
L     &5X96-U=&EO;E]L;V<N:'1M;%!+!08      0 ! $    !+$@     ! 
end


Mime
View raw message