harmony-alerts mailing list archives

Site index · List index
Message view « Date » · « Thread »
Top « Date » · « Thread »
From nom...@intel.com
Subject [build-test alert] FAILED Linux x86_64: ehwa
Date Fri, 11 Jan 2008 12:40:04 GMT
svn.revision=610727
BUILD FAILED:
	Ant Error Message:
/export/users/cc/cc-suites/scripts/cc-exec-adaptor.xml:104: The following error occurred while
executing this line: /export/users/cc/cc-suites/adaptors/ehwa/adaptor.xml:82: The following
error occurred while executing this line: /export/users/cc/cc-suites/scripts/framework.xml:1079:
Java returned: 1

Date of build:	2008-01-11 18:29:56 +0600
Time to build:	10 minutes 2 seconds
Last changed:	01/11/2008 13:41:07
Last log entry:	snapshot

***********************************************************
Errors/Warnings:	(91)
            
[exec] Result: 25
[echo]
[echo]
[echo] ========================== EHWA.log =======================
[echo]
[echo] Eclipse Home = /export/users/cc/cc-suites/build/libs/eclipse-3.2.1-lnx-x86_64/eclipse
[echo] Tested JRE = /export/users/cc/cc-suites/build/checkouts/snapshot/hdk/jdk/jre
[echo] Tested JRE options for Eclipse launching =
[echo] Delay factor = 2
[echo]
[echo] --- Automated EHWA scenario for Eclipse 3.2.1 ---
[echo]
[echo] Start:
[echo]
[echo] Run Eclipse
[echo] Select workspace
[echo]  wait window 'Workspace Launcher' to appear ...
[echo]  window 'Workspace Launcher' appeared
[echo] Press 'OK' button
[echo]  wait window '' to close ...
[echo]  window '' successfully closed
[echo] Close Welcome page
[echo]  wait window 'Java - Eclipse SDK' to appear ...
[echo]  window 'Java - Eclipse SDK' appeared
[echo] Create new project
[echo]  wait window 'New' to appear ...
[echo]  window 'New' appeared
[echo] Select new Java project
[echo]  wait window 'New Java Project' to appear ...
[echo]  window 'New Java Project' appeared
[echo] Type 'EHWA' as project name
[echo] Press 'Finish' button
[echo]  wait window 'New Java Project ' to close ...
[echo]  window 'New Java Project ' successfully closed
[echo] Create new Java class
[echo]  wait window 'Java - Eclipse SDK' to appear ...
[echo]  window 'Java - Eclipse SDK' appeared
[echo]  wait window 'New' to appear ...
[echo]  window 'New' appeared
[echo] Select new Java class for 'EHWA' project
[echo]  wait window 'Java Class' to appear ...
[echo]  window 'Java Class' appeared
[echo] Type 'EHWA' as class name, press 'Finish' button
[echo] Select the 'public static void main(String[] args)' checkbox
[echo] Press 'Finish' button
[echo]  wait window 'New Java Class ' to close ...
[echo]  window 'New Java Class ' successfully closed
[echo] Put System.out.println("Hello, world"); into EHWA class
[echo]  wait window 'Java - EHWA.java - Eclipse SDK' to appear ...
[echo]  window 'Java - EHWA.java - Eclipse SDK' appeared
[echo] Save EHWA class
[echo] Run EHWA class
[echo] Exit Eclipse
[echo]  wait window 'Java - EHWA.java - Eclipse SDK' to appear ...
[echo]  window 'Java - EHWA.java - Eclipse SDK' appeared
[echo]  wait window 'Java - EHWA.java - Eclipse SDK ' to close ...
[echo] ERROR: Failed to close 'Java - EHWA.java - Eclipse SDK ' window during 240 sec!
[echo]
[echo] Print error screen picture:
[echo] 	Picture was saved to /export/users/cc/cc-suites/build/results/ehwa/20080111_0629/error.xwd.
Use 'xwud -in error.xwd' to view the saved file.
[echo]
[echo] Kill Eclipse:
[echo] 	Found 1 Eclipse processes
[echo] 	Process 0:
[echo] 	Eclipse process was killed
[echo]
[echo]
[echo] EHWA FAILED!
[echo]
[echo] ======================= eclipse.log =======================
[echo] Install location:
[echo]     file:/export/users/cc/cc-suites/build/libs/eclipse-3.2.1-lnx-x86_64/eclipse/
[echo] Configuration file:
[echo]     file:/export/users/cc/cc-suites/build/libs/eclipse-3.2.1-lnx-x86_64/eclipse/configuration/config.ini
loaded
[echo] Configuration location:
[echo]     file:/export/users/cc/cc-suites/build/libs/eclipse-3.2.1-lnx-x86_64/eclipse/configuration/
[echo] Framework located:
[echo]     file:/export/users/cc/cc-suites/build/libs/eclipse-3.2.1-lnx-x86_64/eclipse/plugins/org.eclipse.osgi_3.2.1.R32x_v20060919.jar
[echo] Framework classpath:
[echo]     file:/export/users/cc/cc-suites/build/libs/eclipse-3.2.1-lnx-x86_64/eclipse/plugins/org.eclipse.osgi_3.2.1.R32x_v20060919.jar
[echo] Debug options:
[echo]     file:/export/users/cc/cc-suites/build/checkouts/ehwa/.options not found
[echo] Time to load bundles: 107
[echo] Starting application: 4287
[echo] Application Started: 64634
[echo]
[echo] ===========================================================
BUILD FAILED
/export/users/cc/cc-suites/build/checkouts/ehwa/ehwa_run.xml:210: EHWA FAILED!
Total time: 10 minutes 0 seconds
The execution FAILED with the following exception:
The following error occurred while executing this line:
/export/users/cc/cc-suites/adaptors/ehwa/adaptor.xml:82: The following error occurred while
executing this line:
/export/users/cc/cc-suites/scripts/framework.xml:1079: Java returned: 1

***********************************************************
Unit Tests: (0)
        
No Tests Run: This project doesn't have any tests

***********************************************************
Modifications since last successful build:	(1)
            
add cc-snapshot log20080111134107Lbuild.68 01/11/2008 13:41:07snapshot

begin 644 execution_log.zip
M4$L#! H    (  "5*SA,-KS$(08  $H@   2    97AE8W5T:6]N7VQO9RYH
M=&ULU5IM3]M($/Y<?L5<I5-:J;&3P%%(*1+'B_JF*PI4_8 JM%E/DH6-U]I=
MY^5^_<VN'2 0.W%*H6=1A.O9V6<>S]M.LC>P0[F_UU71='\OT;B_Q\#8J<3W
MM9Z*;=V(?[$-.XT_W]7V-](D8A;K9A2W-S9T2K_!71=7;,1^P-^ID%%/2)+'
MP9A=DD P&<HYF;F;!QJROY$/U ^HU^O026,X_O#]  S'F&FA0,5@!P@]):4:
MB[@/7,4]T4\ULX*>T:)"A>=H+$;PJ7,,[R'$2:*T#5.#VH2<TT_=I,*B";O.
MC) /D%^KU)K0Q"PQ V7#070=7KE_&E?91"4.DJ'-"J6/N12)0?B@AK@**"FZ
M)L1L47TS: 7-NHPG]<G.]N7VUNQ!X6Y'*-D4>HQ;I6FW5AGUZUW%K]K3&;#4
M*F';R\2L)S$@GI>*YC:O*A>,B%EZ*\5N=RB1Q<ZQ9N]FWL&"("A<>L9&"(P6
M)%-0O0(%5CW2:P[G] 9=QJ_39 $V!X?,HM_.JK<M<!%JGAC'1802+7H?1.N 
M1$*C<\3I+X$1*MV_>>?*],5O!8@KC0$E/RN&#Z+U68%E^?W9(04&K=O'%(9:
M!X=J=#=*QTI?FX1Q7!2A/V7 ;2%P12V\V:@\@T":^"((+I>Y[4HSQZ%&YG%I
M-*FTY@Z^1<LNAM<DD"^C:D,W[>6&Y+HS,UJ-QDZCV6Q>-K9;N\49S3)MYRMP
MH>PIF6WP#1C$G\$2NMT"J?I4XS5$:)F0"_U@@IP*:*?SM=.&$Q(B'BBG<:G(
M&VJ?2!+J'GEPE?^=>\K9T6>H ?4.D1I#E&I'>VNK0;CY'\ L!![49>Z9E]YE
M@T2"%#&2X.;"M^C!=+Q1;6C]54A2X8/B)^\++[BAJDB@.HZG[4B>JR5SKC6S
M5+(TY@/G!25\W6^=UF#6];,'U/\,?<C.=[5W\7@2O73U/7R\MM=8Z!OM'$"Q
M=LJ>W-Y)M<7>/&;"SF*L]OUFP1?/->J:"U66),C*\V*IBFP]1L49B;*,@=K7
MSS7HIM92\[4BX-IM)ED)70U,RCEMUDNEG&8KH^+-#KWF[RBY"[*$]5=F\M.#
M5%:9R44JEC*9%1J(<0R)5E?."U9$_ ^.*T/T:Y9BRKW18?(V50>6K3O-UI6A
MG+M)J&+8H$<5)QC2*Z>WM^@P,=]U-WW3O5+/?;<RKD35/2N6\G8^3:A NOQ#
MPN:&MI@-2]PP#Z43$0LSJ!I.]T%"U?A:H*!:P-VZKU?#)2-K?O.8>ZXXRLAQ
M%2EWDHJ!Y94<.B7K\90OK>K'&6SGQ6\(<25OS1EP<Z5:DG:EX& L]>,<1DI$
M,&0B?G5F7:-X\0.8[IO7M6RJT%637QTRGHWU V:VO%*XG*86SJ;4- T#ZK8"
MG_!D_.KE!Y12O7'U7T8O7[\#^F^5-3)K!=3BWGSMX"I2MSP W-AF%3-NII%+
MY(XG9.W2;NKW)J4*NE7=\[$/:]7;W%/GRH!:4W8S7"/&D AN4XTE3?.+TTR$
M*#%@R%FBRH7\WA'7 P@FXRB ;XZ R3B-H"YBN'G@&1T)"F.7E;)-70L1K&'T
M9R'EC- R,T]4&D?4JLRXI[SO<@:6>/J+TTP&&F6*[RGT/%X3J+(<M,;)U47F
MR<''+\='):Y1_: -L^'86@?MCS&5$N)?*NYG6\6#9W?Y#T\>::16W W-S:/]
MED\&:G[.E]T%5"&)'Q:5'4#F,#\]F?.X"[<]T=1_N/-Q!A&CIT.8R+0O8O-@
M\)T/L#J;K<GEB-+0=F.WN4MI5J]@A*]S";.#_Z,91]A-^[.)SV,8<&\0',R&
M2;&RU"Y3[BQN5<70'_Z<DU,C&$<231N:C;?E@QQ7[*A04S^:>3MLM7:*EQS<
M2F;+R?M@>VM[<^M1AXY+K^*3\]_?/GXYRE/TW(.JU-_]=+G=:E+QN9O\BP&<
M*\K%X#YU<>S#4,0I[0&^G5!Q9#8VSJG:NF%NZFG,%%+[80?W/G7&"<<D2T'G
M\P]\;Z$X3S6U5S >N'-_KI$>VX$P?I+<WB@QFD4LL4KGUN9WWMB=5AM^P8;4
M"XF$V.W-0M]O1@ZZV\[.$1JI XJ=1S4W]D*VOQ?ZKPJ$V=<&0O\=@O\ 4$L!
M A0#"@    @  )4K.$PVO,0A!@  2B   !(              *2!     &5X
F96-U=&EO;E]L;V<N:'1M;%!+!08      0 ! $    !1!@     ! 
end


Mime
View raw message