harmony-alerts mailing list archives

Site index · List index
Message view « Date » · « Thread »
Top « Date » · « Thread »
From nom...@intel.com
Subject [build-test alert] FAILED Windows 2003 x86: ehwa
Date Fri, 11 Jan 2008 10:04:45 GMT
svn.revision=610727
BUILD FAILED:
	Ant Error Message:
C:\cc\cc-suites\scripts\cc-exec-adaptor.xml:104: The following error occurred while executing
this line: C:\cc\cc-suites\adaptors\ehwa\adaptor.xml:82: The following error occurred while
executing this line: C:\cc\cc-suites\scripts\framework.xml:1079: Java returned: 1

Date of build:	2008-01-11 16:00:17 +0600
Time to build:	4 minutes 22 seconds
Last changed:	01/11/2008 12:58:57
Last log entry:	snapshot

***********************************************************
Errors/Warnings:	(63)
            
[exec] Result: 1
[echo]
[echo]
[echo] ========================== EHWA.log =======================
[echo]
[echo] --- Automated Eclipse EHWA scenario for Eclipse 3.2.1 ---
[echo]
[echo] Eclipse Home = C:\cc\cc-suites/build/libs/eclipse-3.2.1-win-x86/eclipse
[echo] Tested JRE = C:\cc\cc-suites/build/checkouts/snapshot/hdk/jdk/jre
[echo] Tested JRE options for Eclipse launching =
[echo] Delay factor = 2
[echo]
[echo] Start:
[echo] 	Run Eclipse
[echo] 	Wait Eclipse 'Workspace Launcher' window to appear
[echo] 	window appeared
[echo] 	Select C:\cc\cc-suites\build\checkouts\ehwa\workspace as workspace
[echo] 	Press OK button
[echo] 	Closing window 'Workspace Launcher'
[echo] 	Wait 'Java - Eclipse SDK' window to appear
[echo] 	window appeared
[echo] 	Close Welcome page
[echo] 	Create new  Java project
[echo] 	Wait 'New Project' window to appear
[echo] 	WARNING! Window 'New Project' didn't appear during 60c. Add extra delay for 120c.
[echo] 	ERROR! Window 'New Project' didn't appear during additional 120c. STOP.
[echo]
[echo] An ERROR has ocurred!
[echo]
[echo] Print error screen:
[echo] 	Open mspaint to save errror screen
[echo] 	Wait for 'error - Paint' window
[echo] 	Save error screen
[echo] 	Exit mspaint
[echo] 	Switch to Eclipse
[echo]
[echo] Exit Eclipse:
[echo] 	Eclipse was found and closed.
[echo]
[echo] EHWA FAILED!
[echo]
[echo] ======================= eclipse.log =======================
[echo] Install location:
[echo]     file:/C:/cc/cc-suites/build/libs/eclipse-3.2.1-win-x86/eclipse/
[echo] Configuration file:
[echo]     file:/C:/cc/cc-suites/build/libs/eclipse-3.2.1-win-x86/eclipse/configuration/config.ini
loaded
[echo] Configuration location:
[echo]     file:/C:/cc/cc-suites/build/libs/eclipse-3.2.1-win-x86/eclipse/configuration/
[echo] Framework located:
[echo]     file:/C:/cc/cc-suites/build/libs/eclipse-3.2.1-win-x86/eclipse/plugins/org.eclipse.osgi_3.2.1.R32x_v20060919.jar
[echo] Framework classpath:
[echo]     file:/C:/cc/cc-suites/build/libs/eclipse-3.2.1-win-x86/eclipse/plugins/org.eclipse.osgi_3.2.1.R32x_v20060919.jar
[echo] Debug options:
[echo]     file:/C:/cc/cc-suites/build/checkouts/ehwa/.options not found
[echo] Time to load bundles: 437
[echo] Starting application: 12484
[echo] Application Started: 49592
[echo]
[echo] ===========================================================
BUILD FAILED
C:\cc\cc-suites\build\checkouts\ehwa\ehwa_run.xml:210: EHWA FAILED!
Total time: 4 minutes 20 seconds
The execution FAILED with the following exception:
The following error occurred while executing this line:
C:\cc\cc-suites\adaptors\ehwa\adaptor.xml:82: The following error occurred while executing
this line:
C:\cc\cc-suites\scripts\framework.xml:1079: Java returned: 1

***********************************************************
Unit Tests: (0)
        
No Tests Run: This project doesn't have any tests

***********************************************************
Modifications since last successful build:	(1)
            
add cc-snapshot log20080111125857Lbuild.64 01/11/2008 12:58:57snapshot

begin 644 execution_log.zip
M4$L#! H    ( )6 *SB7".N<2P4  /@7   2    97AE8W5T:6]N7VQO9RYH
M=&ULU5C=4]LX$'^&&?Z'[<,-+Q<[23D*/LH,!7JE[10F<,-#TV&$O8D%BN61
M9!+NK[^5[(28QDJ:Z\><AP".5KN_W=5^Z2 U(W%X<"N3Q\.#7.'A 0-M'@6^
MWA[(S+0T_P<CV&O_]N?VX=9FD2?,8$L_9-'6YM:F*NQ?L,_G._; OL";@HMD
MP 7MP73,;H@BF(Q$G:C^]C63\G^,4_D%6JT6](H,3M]='X&.,6.*2Y 9F!1A
M((608YX-(9;9@ \+Q0RG-=K4S/$*M<$$WO=.X34<1_TXII^6+KA!'=Y:_&&<
M8GPO"Z-#G;%<I]*$:7(?WMF/PI58R]PBT22BF?PT%CS7"._D"!NQ"'ZK0RPI
M6R^#;M!ID<:MR=[N]-MF 2<HV",,6&RD(@%=KYG7>WR>=68,6&$D-]%R0N.L
M%Y"%5R"N=%^=,GA I<DEGK-V+)!E]C1-'5,_54$0-.^]9 \(C';DCR '#1R,
M7-O)88U3<,OB^R)?!,<B(%7HM]7D51ML-.H%HOM.=-^*[B\4/?VVOY+HSPD*
M-.@.'1HK.^$*[<E[_$Z2^U(-9]Z4>LA_-898*@PH?1D^^CH(?S*6,C/_"A2!
M1F,YZ^;@Z.%(/LP'UEBJ>YVS&!<&U;>#GB7LOJTZ_1G[);$.1>[*%-C48X7X
M8_Q8(7-P%.I"&#T':^&^SZ-[HJCV45V@EZA!@8IC";_;;N^U.YW.37NGW?:D
M',.4J1?&9N(+TE?C[Z 1&W)0!2&T$,(:A-#*"(0<4L%5D*!A7"SV]@1CZVW+
M*(*.+S?GBF<F&!"G8(1:L^'S5#X/OGG%L_2Z\8&9/DT$ZT"QG<H1U;J1\_7T
MI-?[%FN_Z8J++7^K\@M;AY_;)<W;1; BBU,;9CX_K-[:+ D@S[';<(WG,DMM
M7#-N9NBWKV>I[:-3!-4VD-43.;8UF.4Y,N7!M%'1EH1D)@_I):7'V'QC2@2F
M887\N'%!^4##^0>X+8R1F8?R6$AMW54A7V2!9=;;?D\+T)I9\?+DPP^SFH6+
M<(TBMK&34^;Q4KO<#1F. 1S(7,D[LOI2C3[1CHN2]FM5?+N/>I_./OWU JXK
M<]88)3S)MLW4($FAK.%WVW$ 1TD".#&*48)VH4%QT>G2BD?6::]WWOL622Q)
MN(U8)DK><'EU?N&1T+QR1)%EI4-*YU'&A2*OO5B'T84M)(!*D;XZ5HB^#G_C
M/,<,1G0Z[29RA[9M.VU^VKW,L=:NVZ6X%EQ8/E/W^B*U$K.*E-,)2:D@^EB.
MN8E3J\/2#.4I(Y.GU!7YPF#6N#&;K(LL 4:?V(92LI;_75U\>W3V\?3$X_8U
MZCM,.^+UZOM9I@T3 H2,77OK.4SV<5<=X7$4QG&XQE#GZ35K@Z,3\T.1U'KZ
MZBW@&2=#L 2358'^'+/5P3:+>JO8"&VQ*W%A\F-AY:(8\DR'S^?4&T<>]%YV
M)S</U%GOMO<[^\&=KPP\(8\%TY0,3+H0>WW:[S@-FF?]^2GC_V*)$[PMAM-&
M\3_X[ZE;=0-.,&T],VG*C.9I6&F^MT:UH4#M4)8(U!'LO'RUI+5T%3//!:]B
M@FKFSMZ.IR8^T98,Z,#"SOX?^Y[N=JT!:.GCF]S>_'WV\:1*W?65E1K1^6OA
MJ-MI1YY24'^[DI29P5ZVD%5@Q+."A$"W33,M)82$)M+-JY3*+ VAA;-AR9.J
MLTF?71?C)$;G_\AMF5MP-5K&94,"X]3&4\61EDW*-0B>V63\7%N6L)R&D4K-
MZLUIN=>-X+N)H?Z!YV3,P31#.!&=]JO]J&Q0%9I"9?;H=#:W-@]"=G@0NHO]
ML+SD#]V-_[]02P$"% ,*    " "5@"LXEPCKG$L%  #X%P  $@          
M    I($     97AE8W5T:6]N7VQO9RYH=&UL4$L%!@     !  $ 0    'L%
$      $! 
end


Mime
View raw message