harmony-alerts mailing list archives

Site index · List index
Message view « Date » · « Thread »
Top « Date » · « Thread »
From nom...@intel.com
Subject [build-test alert] FAILED Windows 2003 x86_64: jdktools-test debug
Date Thu, 10 Jan 2008 16:06:50 GMT

BUILD FAILED:
	Ant Error Message:
C:\cc\cc-common\scripts\cc-exec-adaptor.xml:104: The following error occurred while executing
this line: C:\cc\cc-common\adaptors\jdktools-test\adaptor.xml:23: The following error occurred
while executing this line: C:\cc\cc-common\build\checkouts\hdk\working_jdktools\build.xml:242:
The following error occurred while executing this line: C:\cc\cc-common\build\checkouts\hdk\working_jdktools\make\build-test.xml:97:
There were test errors.

Date of build:	2008-01-10 21:39:59 +0600
Time to build:	26 minutes 43 seconds
Last changed:	01/10/2008 15:22:04
Last log entry:	hdk

***********************************************************
Errors/Warnings:	(226)
            
Result: 1
========================================
Testing jdktools binaries...
========================================
Compiling JPDA tests
Since fork is false, ignoring memoryMaximumSize setting
----------
1. WARNING in C:\cc\cc-common\build\checkouts\hdk\working_jdktools\modules\jpda\test\common\unit\org\apache\harmony\jpda\tests\framework\DebuggeeRegister.java
(at line 58)
registered.add(debuggee);
^^^^^^^^^^^^^^^^^^^^^^^^
Type safety: The method add(Object) belongs to the raw type LinkedList. References to generic
type LinkedList<E> should be parameterized
----------
----------
2. WARNING in C:\cc\cc-common\build\checkouts\hdk\working_jdktools\modules\jpda\test\common\unit\org\apache\harmony\jpda\tests\framework\TestOptions.java
(at line 505)
internalProperties.put(name, value);
^^^^^^^^^^^^^^^^^^^^^^^^^^^^^^^^^^^
Type safety: The method put(Object, Object) belongs to the raw type HashMap. References to
generic type HashMap<K,V> should be parameterized
----------
----------
3. WARNING in C:\cc\cc-common\build\checkouts\hdk\working_jdktools\modules\jpda\test\common\unit\org\apache\harmony\jpda\tests\framework\jdwp\PacketDispatcher.java
(at line 114)
eventQueue.add(eventPacket);
^^^^^^^^^^^^^^^^^^^^^^^^^^^
Type safety: The method add(Object) belongs to the raw type List. References to generic type
List<E> should be parameterized
----------
4. WARNING in C:\cc\cc-common\build\checkouts\hdk\working_jdktools\modules\jpda\test\common\unit\org\apache\harmony\jpda\tests\framework\jdwp\PacketDispatcher.java
(at line 249)
replies.put(new Integer(replyPacket.getId()),
replyPacket);
^^^^^^^^^^^^^^^^^^^^^^^^^^^^^^^^^^^^^^^^^^^^^^^^^^^^^^^^^^^^^^^^^^^^^^^^^^^^^^^^^^^^^^^^^^^
Type safety: The method put(Object, Object) belongs to the raw type Hashtable. References
to generic type Hashtable<K,V> should be parameterized
----------
5. WARNING in C:\cc\cc-common\build\checkouts\hdk\working_jdktools\modules\jpda\test\common\unit\org\apache\harmony\jpda\tests\framework\jdwp\PacketDispatcher.java
(at line 284)
commands.put(Id, command);
^^^^^^^^^^^^^^^^^^^^^^^^^
Type safety: The method put(Object, Object) belongs to the raw type Hashtable. References
to generic type Hashtable<K,V> should be parameterized
----------
6. WARNING in C:\cc\cc-common\build\checkouts\hdk\working_jdktools\modules\jpda\test\common\unit\org\apache\harmony\jpda\tests\framework\jdwp\PacketDispatcher.java
(at line 355)
commands.put(Id, command);
^^^^^^^^^^^^^^^^^^^^^^^^^
Type safety: The method put(Object, Object) belongs to the raw type Hashtable. References
to generic type Hashtable<K,V> should be parameterized
----------
----------
7. WARNING in C:\cc\cc-common\build\checkouts\hdk\working_jdktools\modules\jpda\test\common\unit\org\apache\harmony\jpda\tests\framework\jdwp\VmMirror.java
(at line 1834)
frames.add(frame);
^^^^^^^^^^^^^^^^^
Type safety: The method add(Object) belongs to the raw type ArrayList. References to generic
type ArrayList<E> should be parameterized
----------
8. WARNING in C:\cc\cc-common\build\checkouts\hdk\working_jdktools\modules\jpda\test\common\unit\org\apache\harmony\jpda\tests\framework\jdwp\VmMirror.java
(at line 1902)
vars.add(var);
^^^^^^^^^^^^^
Type safety: The method add(Object) belongs to the raw type ArrayList. References to generic
type ArrayList<E> should be parameterized
----------
9. WARNING in C:\cc\cc-common\build\checkouts\hdk\working_jdktools\modules\jpda\test\common\unit\org\apache\harmony\jpda\tests\framework\jdwp\VmMirror.java
(at line 2122)
fields.add(superClassFields.toArray()[i]);
^^^^^^^^^^^^^^^^^^^^^^^^^^^^^^^^^^^^^^^^^
Type safety: The method add(Object) belongs to the raw type ArrayList. References to generic
type ArrayList<E> should be parameterized
----------
10. WARNING in C:\cc\cc-common\build\checkouts\hdk\working_jdktools\modules\jpda\test\common\unit\org\apache\harmony\jpda\tests\framework\jdwp\VmMirror.java
(at line 2132)
fields.add(field);
^^^^^^^^^^^^^^^^^
Type safety: The method add(Object) belongs to the raw type ArrayList. References to generic
type ArrayList<E> should be parameterized
----------
----------
11. WARNING in C:\cc\cc-common\build\checkouts\hdk\working_jdktools\modules\jpda\test\common\unit\org\apache\harmony\jpda\tests\jdwp\DebuggerOnDemand\OnthowDebuggerLaunchDebuggee.java
(at line 94)
class ExceptionForDebugger extends Exception {
^^^^^^^^^^^^^^^^^^^^
The serializable class ExceptionForDebugger does not declare a static final serialVersionUID
field of type long
----------
----------
12. WARNING in C:\cc\cc-common\build\checkouts\hdk\working_jdktools\modules\jpda\test\common\unit\org\apache\harmony\jpda\tests\jdwp\Events\ClassUnloadDebuggee.java
(at line 32)
import java.util.LinkedList;
^^^^^^^^^^^^^^^^^^^^
The import java.util.LinkedList is never used
----------
13. WARNING in C:\cc\cc-common\build\checkouts\hdk\working_jdktools\modules\jpda\test\common\unit\org\apache\harmony\jpda\tests\jdwp\Events\ClassUnloadDebuggee.java
(at line 97)
boolean isOutOfMemory = false;
^^^^^^^^^^^^^
The local variable isOutOfMemory is never read
----------
14. WARNING in C:\cc\cc-common\build\checkouts\hdk\working_jdktools\modules\jpda\test\common\unit\org\apache\harmony\jpda\tests\jdwp\Events\ClassUnloadDebuggee.java
(at line 171)
public Class loadClass(String name) throws ClassNotFoundException {
^^^^^
Type safety: The return type Class for loadClass(String) from the type ClassUnloadDebuggee.CustomLoader
needs unchecked conversion to conform to Class<?> from the type ClassLoader
----------
15. WARNING in C:\cc\cc-common\build\checkouts\hdk\working_jdktools\modules\jpda\test\common\unit\org\apache\harmony\jpda\tests\jdwp\Events\ClassUnloadDebuggee.java
(at line 179)
public Class findClass(String name) throws ClassNotFoundException {
^^^^^
Type safety: The return type Class for findClass(String) from the type ClassUnloadDebuggee.CustomLoader
needs unchecked conversion to conform to Class<?> from the type ClassLoader
----------
----------
16. WARNING in C:\cc\cc-common\build\checkouts\hdk\working_jdktools\modules\jpda\test\common\unit\org\apache\harmony\jpda\tests\jdwp\Events\CombinedEvents002Test.java
(at line 100)
boolean expectColocatedEvents = (testedMethodStartCodeIndex == testedMethodEndCodeIndex);
^^^^^^^^^^^^^^^^^^^^^
The local variable expectColocatedEvents is never read
----------
----------
17. WARNING in C:\cc\cc-common\build\checkouts\hdk\working_jdktools\modules\jpda\test\common\unit\org\apache\harmony\jpda\tests\jdwp\Events\CombinedEvents003Test.java
(at line 53)
private boolean eventMethodExitReceived = false;
^^^^^^^^^^^^^^^^^^^^^^^
The field CombinedEvents003Test.eventMethodExitReceived is never read locally
----------
18. WARNING in C:\cc\cc-common\build\checkouts\hdk\working_jdktools\modules\jpda\test\common\unit\org\apache\harmony\jpda\tests\jdwp\Events\CombinedEvents003Test.java
(at line 76)
int EXPECTED_EVENTS_COUNT = EXPECTED_EVENTS_ARRAY.length;
^^^^^^^^^^^^^^^^^^^^^
The local variable EXPECTED_EVENTS_COUNT is never read
----------
----------
19. WARNING in C:\cc\cc-common\build\checkouts\hdk\working_jdktools\modules\jpda\test\common\unit\org\apache\harmony\jpda\tests\jdwp\Events\CombinedEventsTest.java
(at line 84)
int EXPECTED_EVENTS_COUNT = EXPECTED_EVENTS_ARRAY.length;
^^^^^^^^^^^^^^^^^^^^^
The local variable EXPECTED_EVENTS_COUNT is never read
----------
20. WARNING in C:\cc\cc-common\build\checkouts\hdk\working_jdktools\modules\jpda\test\common\unit\org\apache\harmony\jpda\tests\jdwp\Events\CombinedEventsTest.java
(at line 212)
int EXPECTED_EVENTS_COUNT = EXPECTED_EVENTS_ARRAY.length;
^^^^^^^^^^^^^^^^^^^^^
The local variable EXPECTED_EVENTS_COUNT is never read
----------
21. WARNING in C:\cc\cc-common\build\checkouts\hdk\working_jdktools\modules\jpda\test\common\unit\org\apache\harmony\jpda\tests\jdwp\Events\CombinedEventsTest.java
(at line 348)
int EXPECTED_EVENTS_COUNT = EXPECTED_EVENTS_ARRAY.length;
^^^^^^^^^^^^^^^^^^^^^
The local variable EXPECTED_EVENTS_COUNT is never read
----------
22. WARNING in C:\cc\cc-common\build\checkouts\hdk\working_jdktools\modules\jpda\test\common\unit\org\apache\harmony\jpda\tests\jdwp\Events\CombinedEventsTest.java
(at line 732)
String failureMessage = "## FAILURE during checking events! !";
^^^^^^^^^^^^^^
The local variable failureMessage is never read
----------
23. WARNING in C:\cc\cc-common\build\checkouts\hdk\working_jdktools\modules\jpda\test\common\unit\org\apache\harmony\jpda\tests\jdwp\Events\CombinedEventsTest.java
(at line 894)
String failureMessage = "## FAILURE during checking events !";
^^^^^^^^^^^^^^
The local variable failureMessage is never read
----------
----------
24. WARNING in C:\cc\cc-common\build\checkouts\hdk\working_jdktools\modules\jpda\test\common\unit\org\apache\harmony\jpda\tests\jdwp\Events\CombinedEventsTestCase.java
(at line 135)
long methodStartCodeIndex = lineTableReply.getNextValueAsLong();
^^^^^^^^^^^^^^^^^^^^
The local variable methodStartCodeIndex is never read
----------
25. WARNING in C:\cc\cc-common\build\checkouts\hdk\working_jdktools\modules\jpda\test\common\unit\org\apache\harmony\jpda\tests\jdwp\Events\CombinedEventsTestCase.java
(at line 187)
long methodStartCodeIndex = reply.getNextValueAsLong();
^^^^^^^^^^^^^^^^^^^^
The local variable methodStartCodeIndex is never read
----------
----------
26. WARNING in C:\cc\cc-common\build\checkouts\hdk\working_jdktools\modules\jpda\test\common\unit\org\apache\harmony\jpda\tests\jdwp\Events\ExceptionTest.java
(at line 188)
long frameID = reply.getNextValueAsFrameID();
^^^^^^^
The local variable frameID is never read
----------
----------
27. WARNING in C:\cc\cc-common\build\checkouts\hdk\working_jdktools\modules\jpda\test\common\unit\org\apache\harmony\jpda\tests\jdwp\ThreadReference\FramesTest.java
(at line 450)
frames.add(new FrameStruct(frameID, loc));
^^^^^^^^^^^^^^^^^^^^^^^^^^^^^^^^^^^^^^^^^
Type safety: The method add(Object) belongs to the raw type Vector. References to generic
type Vector<E> should be parameterized
----------
----------
28. WARNING in C:\cc\cc-common\build\checkouts\hdk\working_jdktools\modules\jpda\test\common\unit\org\apache\harmony\jpda\tests\jdwp\share\JDWPUnitDebuggeeProcessWrapper.java
(at line 233)
argv.add(val);
^^^^^^^^^^^^^
Type safety: The method add(Object) belongs to the raw type Vector. References to generic
type Vector<E> should be parameterized
----------
29. WARNING in C:\cc\cc-common\build\checkouts\hdk\working_jdktools\modules\jpda\test\common\unit\org\apache\harmony\jpda\tests\jdwp\share\JDWPUnitDebuggeeProcessWrapper.java
(at line 253)
return (String[])argv.toArray(args);
^^^^^^^^^^^^^^^^^^
Type safety: The method toArray(Object[]) belongs to the raw type Vector. References to generic
type Vector<E> should be parameterized
----------
29 problems (29 warnings)
JPDA exclude list: C:\cc\cc-common\build\checkouts\hdk\working_classlib\deploy\build\jdktools.jpda.exclude
Running JPDA tests
Debugger JVM=C:\cc\cc-common\build\checkouts\hdk\target\hdk\jdk\jre/bin/java
Debuggee JVM=C:\cc\cc-common\build\checkouts\hdk\target\hdk\jdk\jre/bin/java
SAMSA exclude list: C:\cc\cc-common\build\checkouts\hdk\working_classlib\deploy\build\jdktools.samsa.exclude
Running SAMSA tests
test.jre.home=C:\cc\cc-common\build\checkouts\hdk\target\hdk\jdk\jre
Run jdk/bin/java -version in C:\cc\cc-common\build\checkouts\hdk\working_jdktools\build\test_report
java version "1.5.0"
pre-alpha : not complete or compatible
svn = r610729, (Jan 10 2008), Windows/em64t/msvc 1400, debug build
http://harmony.apache.org
Run jdk/bin/javac -version in C:\cc\cc-common\build\checkouts\hdk\working_jdktools\build\test_report
Run jdk/bin/javah in C:\cc\cc-common\build\checkouts\hdk\working_jdktools\build\test_report
Run jdk/bin/javadoc in C:\cc\cc-common\build\checkouts\hdk\working_jdktools\build\test_report
Run jdk/bin/jarsigner in C:\cc\cc-common\build\checkouts\hdk\working_jdktools\build\test_report
Run jdk/bin/keytool -help in C:\cc\cc-common\build\checkouts\hdk\working_jdktools\build\test_report
Compiling TOOLS tests
Since fork is false, ignoring memoryMaximumSize setting
----------
1. WARNING in C:\cc\cc-common\build\checkouts\hdk\working_jdktools\modules\tools\src\test\java\org\apache\harmony\tests\tools\javah\Test\Test01.java
(at line 24)
private static final long xxx2 = 1;
^^^^
The field Test01.xxx2 is never read locally
----------
1 problem (1 warning)
TOOLS exclude list: C:\cc\cc-common\build\checkouts\hdk\working_classlib\deploy\build\jdktools.tools.exclude
Running TOOLS tests
test.jre.home=C:\cc\cc-common\build\checkouts\hdk\target\hdk\jdk\jre
The test report is in C:\cc\cc-common\build\checkouts\hdk\working_jdktools\build\test_report\html\index.html
The execution FAILED with the following exception:
The following error occurred while executing this line:
C:\cc\cc-common\adaptors\jdktools-test\adaptor.xml:23: The following error occurred while
executing this line:
C:\cc\cc-common\build\checkouts\hdk\working_jdktools\build.xml:242: The following error occurred
while executing this line:
C:\cc\cc-common\build\checkouts\hdk\working_jdktools\make\build-test.xml:97: There were test
errors.

***********************************************************
Unit Tests: (160)
        
error: testFieldAccess001 org.apache.harmony.jpda.tests.jdwp.MultiSession.FieldAccessTest
Unit Test Error Details:	(1)
                
Test: testFieldAccess001Class: org.apache.harmony.jpda.tests.jdwp.MultiSession.FieldAccessTestorg.apache.harmony.jpda.tests.framework.TestErrorException:
Debuggee process did not finish during timeout
	at org.apache.harmony.jpda.tests.jdwp.share.JDWPUnitDebuggeeProcessWrapper.WaitForProcessExit(JDWPUnitDebuggeeProcessWrapper.java:284)
	at org.apache.harmony.jpda.tests.jdwp.share.JDWPUnitDebuggeeProcessWrapper.finishProcessAndRedirectors(JDWPUnitDebuggeeProcessWrapper.java:87)
	at org.apache.harmony.jpda.tests.jdwp.share.JDWPUnitDebuggeeWrapper.stop(JDWPUnitDebuggeeWrapper.java:109)
	at org.apache.harmony.jpda.tests.jdwp.share.JDWPTestCase.internalTearDown(JDWPTestCase.java:108)
	at org.apache.harmony.jpda.tests.jdwp.share.JDWPSyncTestCase.internalTearDown(JDWPSyncTestCase.java:83)
	at org.apache.harmony.jpda.tests.jdwp.share.JDWPRawTestCase.tearDown(JDWPRawTestCase.java:118)
Caused by: java.lang.IllegalThreadStateException: process has not exited
	at java.lang.Runtime$SubProcess.exitValue(Runtime.java:357)
	at org.apache.harmony.jpda.tests.jdwp.share.JDWPUnitDebuggeeProcessWrapper.WaitForProcessExit(JDWPUnitDebuggeeProcessWrapper.java:279)
	at org.apache.harmony.jpda.tests.jdwp.share.JDWPUnitDebuggeeProcessWrapper.finishProcessAndRedirectors(JDWPUnitDebuggeeProcessWrapper.java:87)
	... 14 more

***********************************************************
Modifications since last successful build:	(1)
            
add cc-hdk log20080110152204Lbuild.420 01/10/2008 15:22:04hdk

begin 644 execution_log.zip
M4$L#! H    ( -:P*CCS@8QB-1(  )I^   2    97AE8W5T:6]N7VQO9RYH
M=&UL[5W_4]NZLO\99OH_Z)X[;R[,$).O)'!3WO" WM)3"H]0SGO3]'6$K20&
MQ_*5;""W<_[WMRO926PG3@!1TL[-M$PB2ZO5?G97J[4LMP?AT-MO7W-GM-\.
M!-MO4R+#D<?>_JW'_; DW7^Q/=(J_\??_[;_9CT*'!JRDKSS]]ZLOUDO219&
M0>G&N0TY]V3I7NKBN%JV7$38["@*/->&ZPX)!+]A=DA\.F3$]8D[#+@(+7(>
MEU_RH/21W3$/:P9,A"/BL)[KNZ'+?:F_ YF>*V2([0_WNK8-_THV'PZYWY6V
M<(-0=N/6+I/6P] CU'<([5/L,-_F.G(]IVL/F'W+(V@[<&Z[]US<NG[_6S*@
M[I#>L@Q5'&#(9 @C)/CYPNP!_TK6WR[Y6;^$QM )23HAUZY/!5*WK.6I(!NV
MQZA?0F9D"<801*$2O\V#4>E&L%+/]9A&Q!X,N9,MBZOM)2,J09U(7U4#&]XZ
MKOA*#@53(,*/O:=)45?"+KX)ALB_7 <2!Z-^:KED4#KDP\#U4/H?SH\.2-SB
MQ9CIVAZ5DB5=W- [:D\S46U6B.21L!E1N)"0OU"?'=?'3J =<27I44^R+>+V
M?2Z0CR$;<C$ZI0_N,!IVP!,0,'A4TC21TOB3+J]8Y(^#BT\GG_[Q=$/3JM>]
M 8^BQM&-6T?@!+I<]+LTH$"C.Z "BD>3BK+;$^!6D&+WB%U'_3YC%ZSORI )
M"QE,\THV:$A ^(PT6IOI2VLB;L8<BSK.AA-3V_P[R53\OSF?=+7+40""I#T6
MCO;(Y8"!F,,!!Y<$M,^NT?%MDFOF<;^O@ ^AAJ#W),1F'UW_ECD?@1V+7+ >
M\ 3XJ6I]YC/AVMEJ[>-](@<\\AR@20**,H&A );.<B#.*Z^N"KCH-\\"-2,4
MXUIN9(%U?1"%3[WSB2<'9[F!T]$6N:->!!@O"?&CT<:.--I;9!'J[ZD<G-*@
M$/*X3OOWK:L70KRV*HC?./=!]YS:MRP\<F5 0VA1;-.52CV+/805?OC?$8N8
M,FKU4]-\#.8F+7NA31NPYOK/BV&UOIMWS!!*)D;+[LD)V'.?B0TL'VGB5I^%
M)\[&YN96ANZ"SQ2)I_B IWY>QG>$]-IC"[V'JF7 ?S1^8AUKY?P$=@P+!JUD
M)\X6B0N6UXI? =.=GQ?36B,W[_\;TZ+RYDIA?34\=87@"^;W5BUGN(J.5).[
M^KH87'.3^8$0=+1P1A_7>O:TWOH)(=LM5[.0W5&A 8,OQ7#]O%#M_GQ052O5
M'%0]EWF.!DM&L'@ZQ.S".UT8<B6NC<TO[M>G!T\_+\25\L^(<:T(8_7U5_:@
M<[%\Y2260C#.7XDS_XAAG-(]\T&0]TGQ1QKY]B!)<A7"O)N/;]%PR?&#S50.
MY1T7"5G"'D(&4=+D(OF>::S72DM8[P!3A\*EGOLOC%Y(0:\.!Z!]'A*'02W!
M"-Z0H"% WG-]ZL5TKIB0T/#SR1%1NDEX3ZL$JM,S(7_EU):"_!CS$;*KW.IG
MW^/460K?O!'K>RH$?UI1Z'K6)#>8-6?R&#@+Z&(JV6=W@&4DE_:9KYQ=>H[0
M=YM9H5\#/XSZ((BS*#SKG:H\.GFK$^QSQ$X6"-SC-F@_1$:NLJ TZ;'$!:/+
M2OR5<T'/D7BE6<F*/(BN/? 1BA)!0NK;1B=4=S(PI;L),XS@]U+7^<3#=SSR
MG47.C2PSL0D61L+7#DAST.,BQ\4FZ0D^5//<I&9FU(>1#/GP(Q0!F#YCX'[1
MN0,*S(%EJG^G_1[.A/ +>AFJFT-(J?V?^[,ZT+26U(E7SMT\3R=R^<&43L#L
ML0(ZD>5B]75BKJZ\<DXHI2M\>(U; ?3/<KF*-X6*M:5<GN>TV4, H>DA1X<;
M)C3!>6]@O\PY54%L)Z0"ZCCLQ'?8 WG[EDQ?/0:0DVNYJ'FFOU_:[\_F[@G^
M?RZNKYS_*<*UMA#71BWG!(1[!Y(B8WB15@S3@QM>,)NY=V!("V;G0M1FX:;#
MTMDCF,=#"D:-O#=:$K97S@$]#[;FSHQ[L^3X?\Z/#R^/C[X=7QU_NNQ\.SS[
M_.D2@,J6'UQ<'/ROY3&_'PYFX?<T2YO=NTE+>^5<T'S(%N*5OT_R"^%5?>7\
MS3-PJ5;R"\!?")A52,8\#9A:/;>MZ%<"9I52)H\#IIE/F<3K@QYUO4BP4R8E
M[3, Y;>__I6\.SCY^/GBF#B1JJ/&A%_4C"[_0O[RVU)9E8709#I_"B:KE%%Y
MY.R23U,^'9,5@F0N5*N4BLE!=4CE@I5W+7>'';.P<;H_NU)2;2Y1HA>XQP8W
MZ'QB#^$5;K<[@)6IW]^8O61ZDHN;R<-3K&F5,B-/@*B5RU$6021^(F3F(K9"
M^8EQ0FEQ7J*5BQ,44.J>WLG1'&S>Z:O%\"QV<'$?)D%8A63"Y0 ',KZ-V%72
M6CP+U1NY%-'4GA+<;Z@(P<P4V>%&++PM%.KF*MSUOH*K7!3>/M557FZ+^"JD
M)"1<8-T/1W^<?X8624[U7' 0B/Q#T"!8M">PEDLI4=&_B_>I>#]JG\J/@[.Z
M"FF)Y\.6SP3&&?DX\_[EZZ;",=FM C_DW%SM^/-4BTUZT3!#WRL!-#Y7!YY_
M*,D&_+BGP@?!R$U\6"J >08@*+$'VXL<EGE@2CTF%5\"><OP<0]%J=O_GGO=
M=6 RXZ.X;J(]%BJ#%5./'QR<^=C61>3[LQ[:2JX3,MY5\.'J].TR'$(X E.K
M^GJ#_P7;AEAK>Z)I.=K,'.TO-V@>DW&!G5C:3JS83K1HU% MM!/KRA5A1+U3
MJ 1:;\7;(G!N2Y/$$DGP"4Q2V2+O]%)&[I'R%CG&S4'ZZZ4[9(1Y-)#,V2,M
MJUIK$,GLYY/:L9J[35.D=LL[IDBUFL8&N%MKF2'5M"J-E1Q@HU9(JK8LJ6K9
M:E8+2567)56I62WP7*:$52EFZU'"JAL35JU>3*N^+*T&"+Y<3.LQTC*FI#LM
M0[ZA:35V#8VO:=47N)F=94G5:^ <BI7T,0K?*%=6SBDWK5JEV#L\AJL=8YJU
MVS*F#HOFPJ6M$-;$Y;JQR;!9,>3^C')E;-II6,V:,8]E, 9I+?#)KX$@D"J;
M,T)S>K5C3E2K&(XV%SB&5PEF0.H-<R,TYY!7DU3+W.1E,.!N50VM*##",D;*
MH*Q,*D/+7%!DT!_OF%M]5<VM3<R1,CD-KF2NP:2VFPID("9J&4/0J+:;,^?5
MY,J@BIKS5\;R,K4RK'G-!0T&$WZF'!:L<9K&)D*34XY!>S:HHP97$P87<0M<
M0V-I=:^9R]D:79H81- 0I:95-94WK"!7A@RG8G!^KABT0J2U:^QNP*+8_3'K
MR[HY3UHQEUDSEX6L_K )^C%27[04?Q2M>C%?R]]8J%J[YF9[@PO,54QBF>7*
MW#T88V*O@8<W-,"&93 #LGKX@>=;</?R=8+D'8-<F?.BLPSPZ=L;WG-O:M>K
M@8FZ M.8J2B^!6@:4M>6.<_5>O(MT<J,$>XV9JG&<>=R&3!/(R]T.TSB#A5+
MG15T8.-V+N1%;>(_/C(Q7H.&8&Y# +!5,:1HK84QP&-(&8N84-$,TJH;TW]C
M^M TF$O"9=Y<6HDMO%D/>60/2O&3)U*=TKXW*6>*_%0I&Y_6OK=X#U_GX+3S
M@IOX)!W*J5U\V*_-?9O"*#]QZ-;5Q]WK \[Q2'Z?$Y_A,_0D9 _A%G&X.J6!
MAP-UXOCB;8!Z0*I&N@(663<"/!,?LB=NU<MUB0?UC_?OD5)R",-3=\S..0P?
M.GQ@]E=RH%PK>:]=*]%'/C%!]LB&O4D.>3 2;G\0DLKN+BAAM0R1/>X^C9MU
M>"^\Q[.4U/$65!UMP05Q0=<\UV:^!#7:(A1P"-3+&? 8RG3_:I#)&'^K6 VK
M_!M)5P%M*U$O&%!@"L]O@M$''@L9]H3?H5N@FVXC[WQ\I&&G4FY6=[?(Q@?J
MDTH9^6]M;I$_7-_A]W*;#7?JX?90WMFD4B^#,:DCV(D269K>( R#O>WM9 :*
M)R28FXKALU\<OV/;<\'TR0>4HS[I'] K6\TFP%6S:A:,:H+BR7^=PB\1H"#*
M&DZ+''@>49?!V3#)Q!USK.)A#5YJ-!\^G9346T+(@*E32;05JTW*%'<OIZNG
M?WW&Q^?V9@4,\>Y?Y-PZQ?=S?.'Z8/>OI*U/#,,S6^1^$?5QDW0Q(:5KSD-%
M!31Q0-KX=U\92=^%D)*HTGL7A(R[J6'4S'?0%_$LH=D?W,/ML!Z%&"<^W0P)
M%@H">,KQ@Y\Y/.&>]Q_ $B=M1',_10IU#\GIUXF,61+,<06ST6>[_F/8D@&S
MW9ZK7MZ2\S4YEAS2UOUP,1KSE;"4TL"$,3M^70?H4*J[Y3@<=T;N!ZX]R%/M
M@>O4CTEA_$K%:-$(7!\L(]O-B2J,W\LQI7KJ&0?HAD8A'X+75*> +.H!_-<U
M!P>3A0T/-Q+Q!(D> !9/B_A-V=HT-14DJ)/V\'R3"+@B_X35F09RJM%R4I88
MG"AY7H_PD#_P!5E-N& 2E!?BJF(_YW#[Q3P=D#]"\OI,0A>G-)0A<#UB81%;
M,)WT$=\78TQT= <#Y@76+!>[-F'B>^P5_R0?#BY4P$@ -YI!:JH!ZI/;&\UH
M6*0Y<:LU^)"8  "+%!UL3_+M2[=L),'4&&DGW[XI3[BFGD[4D8I6N.1ZAH J
M4X_%3"C@3Z"@2I=H':#F3O<O)<#A (4Q=TE9GOMQXZEV:R0Y=0C*QVW)!C@.
MQ^WU(-30IW+-Z',SRZ"2'@"CW?(W-##L0+TS*QY;L83AJ@)\=GNK\TY%W]81
MQ,[*B>8A58YE38V*W[FP6*".H][!1;UX1LAUZ8&-I)O D-E],H' KX!+F0\(
M2S83$. H#7)<&7AT1+ (? R>=R7)1@2\W+LP+R8JBMPG7&:E%TI*VI>=@V^?
M+S[N(\V44L&2#!2 #@-TM0,NW'"4;X^]:QKX[9LRFVG-4 4)$E!MFMT,-9#%
MPXBT!QQL&D0(49S<_[[71N/>_U.)"BZKR ZL&BJ1N)(:(M;:(LSJ6[JBI2M:
MX%/V*M5:?59?VBSP[QCW:9M(=;CQ_O+R'&/USMGA[YVL(&,8A?;R>H9 <A.O
MCT1M,0I"WA<T@'E3$8;51:("8@Y)U;B=\)>4*II9:Y.SV7@4%^H8OB'U:1^G
MQ#EN8=)3FKN)/RA@$PS.%)\X*VAM1QNG(68!YO>6YG7<HI!9U%;SW$Z;;$&'
MTPQ/MRGD>.B8YW<8'^KAN/U4^B#;8UK"Z59SF,Z%!J!#.,.3$D[<+Q4>I'_]
M'G<9J;@@?2UAYWNI';\&0_N*/Z=+=!2 96W]]9MZ/=;^GY9ED=*'-D9A2:5"
M1GQ^[R>OVY 93M:4;@CVS[6U?^B5)$LI!5R)QFG_J48H*%MX:VN'^"T]70AV
MEWA\/$4ZRD8\)7U^9@B-]9>)B8<<_"X/!UI9(!#/-G48IC=@5KE@0W['"$QY
ML&10$_MLM[)68@\(%30Y5E]2P\/^U R,3EB&#L].JVLE6& #96C>8; 64;QB
M91UDN")9@,-HLRU1UZ#=Y0 "6:5WB>YR'4 2$!!-@,DVUF<]0_,3?>@S3?&]
M80]@K;Z)E"@Y[%SH$RJR-(!'V^,^B&O\ E"HCIPKL<VHKD(B!U&E?C\=265K
M0[3EA[:"\1R_HBRU!#.\*G#R,=):23*OIPF,50\B5RB, [ 4%>4RQAE,8"Q'
M+8DJT_P7A9)KD]CY*HF<I_M40BXRK?>(8I&!:W_S/6/EF305A!=[:YDF6NNR
M?>?3S<N\7_/R[.QC)_6"S?AA]$F5QK_??9DZ0T'_DL+6!RE@![-.4- CU955
M"DV]&5']*5<6O%EMWIFIJ8/WU3DT#P\/5?*65!8>E##^S#YZ1I^.&C.GB#[G
M[-/D' .R44E.,5CB$ .MBR]V T3__9$W0'+&9?X&R!+W\">CQ_<"R/@.,(0@
M'71_^NCI#@6D"^_A+[TGJF'NE(*655^PEWIIKLJ3IRF?>Q=/!S@E<%0E-@S"
MD2Z,TX131?D23-&5='0(O_5P]$\8E*"^U&>% ^,@QD:Y/,RH#1HJ<D-T(S11
M8^%J%U\\WG7QU"\+OR*_$M;@X83A-^LP\TS_U()0\A$Z,_AF?1V9Q#DI4D&>
MOG6J9VB5I>28 E6G 29G<.VI)E,74/Z$VW8D!-C>_<#UQA3A<H@A$_I)Z"P[
M=.I06&,(.39ZQ5Q2C*\%WZO6]#DP1OI;7M2Z[WKU1W>NWHP^"004&[M-Q06$
M/O?X1VF45GH+0&UOT_WVMGKU_+9^#?VV>B?]_P-02P$"% ,*    " #6L"HX
M\X&,8C42  ":?@  $@              I($     97AE8W5T:6]N7VQO9RYH
9=&UL4$L%!@     !  $ 0    &42      $! 
end


Mime
View raw message