harmony-alerts mailing list archives

Site index · List index
Message view « Date » · « Thread »
Top « Date » · « Thread »
From nom...@intel.com
Subject [build-test alert] FAILED Windows 2003 x86: classlib-test
Date Wed, 09 Jan 2008 13:13:08 GMT
svn.revision=610025
BUILD FAILED:
	Ant Error Message:
C:\cc\cc-suites\scripts\cc-exec-adaptor.xml:104: The following error occurred while executing
this line: C:\cc\cc-suites\adaptors\classlib-test\adaptor.xml:113: exec returned: 1

Date of build:	2008-01-09 18:56:11 +0600
Time to build:	16 minutes 16 seconds
Last changed:	01/09/2008 14:17:10
Last log entry:	snapshot

***********************************************************
Errors/Warnings:	(3)
            
svn: REPORT request failed on '/repos/asf/!svn/vcc/default'
svn: REPORT of '/repos/asf/!svn/vcc/default': 504 Gateway Time-out (http://svn.apache.org)
The execution FAILED with the following exception:
The following error occurred while executing this line:
C:\cc\cc-suites\adaptors\classlib-test\adaptor.xml:113: exec returned: 1

***********************************************************
Unit Tests: (15681)
        
All Tests Passed

***********************************************************
Modifications since last successful build:	(1)
            
add cc-snapshot log20080109141710Lbuild.62 01/09/2008 14:17:10snapshot

begin 644 execution_log.zip
M4$L#! H    ( (^9*3C: ,9)-@$  .L!   2    97AE8W5T:6]N7VQO9RYH
M=&UL?5'!3L,P#+U7ZC^8 RH<NFP")!1*)00#(2&!IMT8ARQUUTA9$Q)GW?AZ
MTHXA.$"4TWO/S_9ST=!:E\725+NRL [+0H"GG<;KK#8MY5Y]((?+\?%55J9)
ML)4@S/VFY6F2)KE'"C:76GBOU3+O_![^DOW&H7^ON$7Y!KT!S*8OS[,Y.'P/
MZ EJH3168%K(F$-K/!.^9D=1RC92L@IK$31E?QN9^O]*#A?C<WB(DW5B!W.U
MQMP$@I.&R'+&HGPDK) -CHQ;G:9),F\0^C:!5)SJ_N;Q:7H'G:(&*#*UT=IT
MJEU%C43;:_A0\H-PSC@P4@;GXFI=$S<\.$::&N5!JQ9C.K=\(67\N0^*T"]$
M)2P9YQ??(4:4#O!HN]9\,CGC@UN,D()KL>(PB?$73)0%&V[)]G=EPY$_ 5!+
M 0(4 PH    ( (^9*3C: ,9)-@$  .L!   2              "D@0    !E
G>&5C=71I;VY?;&]G+FAT;6Q02P4&      $  0!     9@$      
end


Mime
View raw message