harmony-alerts mailing list archives

Site index · List index
Message view « Date » · « Thread »
Top « Date » · « Thread »
From nom...@intel.com
Subject [build-test alert] FAILED Linux x86_64: struts_test
Date Fri, 04 Jan 2008 07:10:13 GMT
svn.revision=607816
BUILD FAILED:
	Ant Error Message:
/export/users/cc/cc-suites/scripts/cc-exec-adaptor.xml:104: The following error occurred while
executing this line: /export/users/cc/cc-suites/adaptors/struts_test/adaptor.xml:67: The following
error occurred while executing this line: /export/users/cc/cc-suites/adaptors/struts_test/adaptor.xml:228:
Test failed

Date of build:	2008-01-04 13:09:41 +0600
Time to build:	26 seconds
Last changed:	01/02/2008 23:17:37
Last log entry:	snapshot

***********************************************************
Errors/Warnings:	(2)
            
The execution FAILED with the following exception:
The following error occurred while executing this line:
/export/users/cc/cc-suites/adaptors/struts_test/adaptor.xml:67: The following error occurred
while executing this line:
/export/users/cc/cc-suites/adaptors/struts_test/adaptor.xml:228: Test failed

***********************************************************
Unit Tests: (1)
        
error: unknown org.apache.harmony.struts.test.WebAppTest
Unit Test Error Details:	(1)
                
Test: unknownClass: org.apache.harmony.struts.test.WebAppTestjunit.framework.AssertionFailedError:
file520468537.html: Lines 147 don't match:
Remote: "        <p>Copyright &copy; 2003-2008 The Apache Software Foundation.</p>"
 Local: "        <p>Copyright &copy; 2003-2007 The Apache Software Foundation.</p>"

	at org.apache.harmony.struts.test.WebAppTest.checkResponse(Unknown Source)
	at org.apache.harmony.struts.test.WebAppTest.performTest(Unknown Source)
	at org.apache.harmony.struts.test.WebAppTest.launchSpiderR(Unknown Source)
	at org.apache.harmony.struts.test.WebAppTest.test(Unknown Source)
	at org.junit.internal.runners.TestMethodRunner.executeMethodBody(TestMethodRunner.java:99)
	at org.junit.internal.runners.TestMethodRunner.runUnprotected(TestMethodRunner.java:81)
	at org.junit.internal.runners.BeforeAndAfterRunner.runProtected(BeforeAndAfterRunner.java:34)
	at org.junit.internal.runners.TestMethodRunner.runMethod(TestMethodRunner.java:75)
	at org.junit.internal.runners.TestMethodRunner.run(TestMethodRunner.java:45)
	at org.junit.internal.runners.TestClassMethodsRunner.invokeTestMethod(TestClassMethodsRunner.java:71)
	at org.junit.internal.runners.TestClassMethodsRunner.run(TestClassMethodsRunner.java:35)
	at org.junit.internal.runners.TestClassRunner$1.runUnprotected(TestClassRunner.java:42)
	at org.junit.internal.runners.BeforeAndAfterRunner.runProtected(BeforeAndAfterRunner.java:34)
	at org.junit.internal.runners.TestClassRunner.run(TestClassRunner.java:52)
	at junit.framework.JUnit4TestAdapter.run(JUnit4TestAdapter.java:32)

***********************************************************
Modifications since last successful build:	(1)
            
add cc-snapshot log20080102231737Lbuild.65 01/02/2008 23:17:37snapshot

begin 644 execution_log.zip
M4$L#! H    ( $1I)#@!+_HTN@(  .4'   2    97AE8W5T:6]N7VQO9RYH
M=&ULY55+;]LP#+[G5Q #MEYJ*TD?R=PL0+&VP(#LTG78H2@&169BM;9D2%0>
M^_6C8@=;VFYKN\,.$VS9)DU^(JF/&A54E>/1U.;K\:AV.!Y)\+0N\=W>S!I*
MO/Z&&0R[KT_VQIU0YY(P\0N3=3J)1PIUHJS)-6EK/,M<8 T 7.=8(N$-G,6G
M-O,,!*YJZT@$C\X+I?A*?-"$7DR#+G/AT(>2O/#D OFOK""A),E2&YG:0(_Z
MA5P[5&3=^F4 <4I:102 Z^J.7=[ >X<<:A[]OW#M.ZX[">>VE@Z3;8H82MEZ
MS4@\QTAZ,-,E MD_PZD"U1VGA &-K'UA213YG;B-MT-1ZJF86DN,NI2:DIEU
M7"RW0'Z0=!Q66[ZM-*)%$:_VH7!CT@JW=HM*NOG]'X/YI8J#3F(^FLBO;X/1
M= .7P9@8N77S5-:2HTH+Z2IKUFF3R#3:I%]P>EK75_RZ8YWP^'PY@5Z71\IO
M:9O^?L(962KI,>FGW?18;#_36U]G$'U&5%AJ*C8Y/^IW#X^'1P>#-))A!^2A
M.H.)-NBA=SB W)H]@DJ2*NY%AI4EYLTK:,>H'L<Z.STO"-[$PI] O]L]2'@:
MPE6!<+I) 'RR,UKR/H$+&PRSC8F5CD0]?K7C'R96R?*)_@?/]_^?AKWS$3><
MATA7Z.W#A=1E8'YDT-V'<^>L\QOYE:X0L&06,JM@F!X<#L&C>N#IZ9L<+DX_
M3,[/.HTU=PWF$/MPTG@F<@7$B!F\'?8JW_:1RBZX)7ZTBV>VD4>Z%G-UIHWV
MQ8:R>I;,..ZF7_R09W^)^^3V%0N(*U0AUJO-2T-;8LW,EJ5=1FQ<*:SC/]G&
MY"=%+!18I8)SW,R715QBZY'55&@/?+Y@UOG-HF4N:SYA=KM[*TQ73(WC00;_
M K??'V;-YFJJU!D).>9='4]QT9SH8G.\?P=02P$"% ,*    " !$:20X 2_Z
M-+H"  #E!P  $@              I($     97AE8W5T:6]N7VQO9RYH=&UL
64$L%!@     !  $ 0    .H"      $! 
end


Mime
View raw message