harmony-alerts mailing list archives

Site index · List index
Message view « Date » · « Thread »
Top « Date » · « Thread »
From nom...@intel.com
Subject [build-test alert] FAILED Windows 2003 x86: jdktools-test debug
Date Thu, 03 Jan 2008 18:29:21 GMT

BUILD FAILED:
	Ant Error Message:
D:\cc\cc-common\scripts\cc-exec-adaptor.xml:104: The following error occurred while executing
this line: D:\cc\cc-common\adaptors\jdktools-test\adaptor.xml:28: The following error occurred
while executing this line: D:\cc\cc-common\build\checkouts\hdk\working_jdktools\build.xml:242:
The following error occurred while executing this line: D:\cc\cc-common\build\checkouts\hdk\working_jdktools\make\build-test.xml:97:
There were test errors.

Date of build:	2008-01-04 00:08:21 +0600
Time to build:	20 minutes 52 seconds
Last changed:	01/03/2008 19:35:26
Last log entry:	hdk

***********************************************************
Errors/Warnings:	(229)
            
Result: 1
[cc-ant]: Test Suite 'jdktools-test' execution. Repository updated: ${repository.updated}
[cc-ant]: Check for 'run' failure of hdk = ${hdk.parameters.run.failed}
[cc-ant]: Result: failed.superiors = '${failed.superiors}'
========================================
Testing jdktools binaries...
========================================
Compiling JPDA tests
Since fork is false, ignoring memoryMaximumSize setting
----------
1. WARNING in D:\cc\cc-common\build\checkouts\hdk\working_jdktools\modules\jpda\test\common\unit\org\apache\harmony\jpda\tests\framework\DebuggeeRegister.java
(at line 58)
registered.add(debuggee);
^^^^^^^^^^^^^^^^^^^^^^^^
Type safety: The method add(Object) belongs to the raw type LinkedList. References to generic
type LinkedList<E> should be parameterized
----------
----------
2. WARNING in D:\cc\cc-common\build\checkouts\hdk\working_jdktools\modules\jpda\test\common\unit\org\apache\harmony\jpda\tests\framework\TestOptions.java
(at line 505)
internalProperties.put(name, value);
^^^^^^^^^^^^^^^^^^^^^^^^^^^^^^^^^^^
Type safety: The method put(Object, Object) belongs to the raw type HashMap. References to
generic type HashMap<K,V> should be parameterized
----------
----------
3. WARNING in D:\cc\cc-common\build\checkouts\hdk\working_jdktools\modules\jpda\test\common\unit\org\apache\harmony\jpda\tests\framework\jdwp\PacketDispatcher.java
(at line 114)
eventQueue.add(eventPacket);
^^^^^^^^^^^^^^^^^^^^^^^^^^^
Type safety: The method add(Object) belongs to the raw type List. References to generic type
List<E> should be parameterized
----------
4. WARNING in D:\cc\cc-common\build\checkouts\hdk\working_jdktools\modules\jpda\test\common\unit\org\apache\harmony\jpda\tests\framework\jdwp\PacketDispatcher.java
(at line 249)
replies.put(new Integer(replyPacket.getId()),
replyPacket);
^^^^^^^^^^^^^^^^^^^^^^^^^^^^^^^^^^^^^^^^^^^^^^^^^^^^^^^^^^^^^^^^^^^^^^^^^^^^^^^^^^^^^^^^^^^
Type safety: The method put(Object, Object) belongs to the raw type Hashtable. References
to generic type Hashtable<K,V> should be parameterized
----------
5. WARNING in D:\cc\cc-common\build\checkouts\hdk\working_jdktools\modules\jpda\test\common\unit\org\apache\harmony\jpda\tests\framework\jdwp\PacketDispatcher.java
(at line 284)
commands.put(Id, command);
^^^^^^^^^^^^^^^^^^^^^^^^^
Type safety: The method put(Object, Object) belongs to the raw type Hashtable. References
to generic type Hashtable<K,V> should be parameterized
----------
6. WARNING in D:\cc\cc-common\build\checkouts\hdk\working_jdktools\modules\jpda\test\common\unit\org\apache\harmony\jpda\tests\framework\jdwp\PacketDispatcher.java
(at line 355)
commands.put(Id, command);
^^^^^^^^^^^^^^^^^^^^^^^^^
Type safety: The method put(Object, Object) belongs to the raw type Hashtable. References
to generic type Hashtable<K,V> should be parameterized
----------
----------
7. WARNING in D:\cc\cc-common\build\checkouts\hdk\working_jdktools\modules\jpda\test\common\unit\org\apache\harmony\jpda\tests\framework\jdwp\VmMirror.java
(at line 1834)
frames.add(frame);
^^^^^^^^^^^^^^^^^
Type safety: The method add(Object) belongs to the raw type ArrayList. References to generic
type ArrayList<E> should be parameterized
----------
8. WARNING in D:\cc\cc-common\build\checkouts\hdk\working_jdktools\modules\jpda\test\common\unit\org\apache\harmony\jpda\tests\framework\jdwp\VmMirror.java
(at line 1902)
vars.add(var);
^^^^^^^^^^^^^
Type safety: The method add(Object) belongs to the raw type ArrayList. References to generic
type ArrayList<E> should be parameterized
----------
9. WARNING in D:\cc\cc-common\build\checkouts\hdk\working_jdktools\modules\jpda\test\common\unit\org\apache\harmony\jpda\tests\framework\jdwp\VmMirror.java
(at line 2122)
fields.add(superClassFields.toArray()[i]);
^^^^^^^^^^^^^^^^^^^^^^^^^^^^^^^^^^^^^^^^^
Type safety: The method add(Object) belongs to the raw type ArrayList. References to generic
type ArrayList<E> should be parameterized
----------
10. WARNING in D:\cc\cc-common\build\checkouts\hdk\working_jdktools\modules\jpda\test\common\unit\org\apache\harmony\jpda\tests\framework\jdwp\VmMirror.java
(at line 2132)
fields.add(field);
^^^^^^^^^^^^^^^^^
Type safety: The method add(Object) belongs to the raw type ArrayList. References to generic
type ArrayList<E> should be parameterized
----------
----------
11. WARNING in D:\cc\cc-common\build\checkouts\hdk\working_jdktools\modules\jpda\test\common\unit\org\apache\harmony\jpda\tests\jdwp\DebuggerOnDemand\OnthowDebuggerLaunchDebuggee.java
(at line 94)
class ExceptionForDebugger extends Exception {
^^^^^^^^^^^^^^^^^^^^
The serializable class ExceptionForDebugger does not declare a static final serialVersionUID
field of type long
----------
----------
12. WARNING in D:\cc\cc-common\build\checkouts\hdk\working_jdktools\modules\jpda\test\common\unit\org\apache\harmony\jpda\tests\jdwp\Events\ClassUnloadDebuggee.java
(at line 32)
import java.util.LinkedList;
^^^^^^^^^^^^^^^^^^^^
The import java.util.LinkedList is never used
----------
13. WARNING in D:\cc\cc-common\build\checkouts\hdk\working_jdktools\modules\jpda\test\common\unit\org\apache\harmony\jpda\tests\jdwp\Events\ClassUnloadDebuggee.java
(at line 97)
boolean isOutOfMemory = false;
^^^^^^^^^^^^^
The local variable isOutOfMemory is never read
----------
14. WARNING in D:\cc\cc-common\build\checkouts\hdk\working_jdktools\modules\jpda\test\common\unit\org\apache\harmony\jpda\tests\jdwp\Events\ClassUnloadDebuggee.java
(at line 171)
public Class loadClass(String name) throws ClassNotFoundException {
^^^^^
Type safety: The return type Class for loadClass(String) from the type ClassUnloadDebuggee.CustomLoader
needs unchecked conversion to conform to Class<?> from the type ClassLoader
----------
15. WARNING in D:\cc\cc-common\build\checkouts\hdk\working_jdktools\modules\jpda\test\common\unit\org\apache\harmony\jpda\tests\jdwp\Events\ClassUnloadDebuggee.java
(at line 179)
public Class findClass(String name) throws ClassNotFoundException {
^^^^^
Type safety: The return type Class for findClass(String) from the type ClassUnloadDebuggee.CustomLoader
needs unchecked conversion to conform to Class<?> from the type ClassLoader
----------
----------
16. WARNING in D:\cc\cc-common\build\checkouts\hdk\working_jdktools\modules\jpda\test\common\unit\org\apache\harmony\jpda\tests\jdwp\Events\CombinedEvents002Test.java
(at line 100)
boolean expectColocatedEvents = (testedMethodStartCodeIndex == testedMethodEndCodeIndex);
^^^^^^^^^^^^^^^^^^^^^
The local variable expectColocatedEvents is never read
----------
----------
17. WARNING in D:\cc\cc-common\build\checkouts\hdk\working_jdktools\modules\jpda\test\common\unit\org\apache\harmony\jpda\tests\jdwp\Events\CombinedEvents003Test.java
(at line 53)
private boolean eventMethodExitReceived = false;
^^^^^^^^^^^^^^^^^^^^^^^
The field CombinedEvents003Test.eventMethodExitReceived is never read locally
----------
18. WARNING in D:\cc\cc-common\build\checkouts\hdk\working_jdktools\modules\jpda\test\common\unit\org\apache\harmony\jpda\tests\jdwp\Events\CombinedEvents003Test.java
(at line 76)
int EXPECTED_EVENTS_COUNT = EXPECTED_EVENTS_ARRAY.length;
^^^^^^^^^^^^^^^^^^^^^
The local variable EXPECTED_EVENTS_COUNT is never read
----------
----------
19. WARNING in D:\cc\cc-common\build\checkouts\hdk\working_jdktools\modules\jpda\test\common\unit\org\apache\harmony\jpda\tests\jdwp\Events\CombinedEventsTest.java
(at line 84)
int EXPECTED_EVENTS_COUNT = EXPECTED_EVENTS_ARRAY.length;
^^^^^^^^^^^^^^^^^^^^^
The local variable EXPECTED_EVENTS_COUNT is never read
----------
20. WARNING in D:\cc\cc-common\build\checkouts\hdk\working_jdktools\modules\jpda\test\common\unit\org\apache\harmony\jpda\tests\jdwp\Events\CombinedEventsTest.java
(at line 212)
int EXPECTED_EVENTS_COUNT = EXPECTED_EVENTS_ARRAY.length;
^^^^^^^^^^^^^^^^^^^^^
The local variable EXPECTED_EVENTS_COUNT is never read
----------
21. WARNING in D:\cc\cc-common\build\checkouts\hdk\working_jdktools\modules\jpda\test\common\unit\org\apache\harmony\jpda\tests\jdwp\Events\CombinedEventsTest.java
(at line 348)
int EXPECTED_EVENTS_COUNT = EXPECTED_EVENTS_ARRAY.length;
^^^^^^^^^^^^^^^^^^^^^
The local variable EXPECTED_EVENTS_COUNT is never read
----------
22. WARNING in D:\cc\cc-common\build\checkouts\hdk\working_jdktools\modules\jpda\test\common\unit\org\apache\harmony\jpda\tests\jdwp\Events\CombinedEventsTest.java
(at line 732)
String failureMessage = "## FAILURE during checking events! !";
^^^^^^^^^^^^^^
The local variable failureMessage is never read
----------
23. WARNING in D:\cc\cc-common\build\checkouts\hdk\working_jdktools\modules\jpda\test\common\unit\org\apache\harmony\jpda\tests\jdwp\Events\CombinedEventsTest.java
(at line 894)
String failureMessage = "## FAILURE during checking events !";
^^^^^^^^^^^^^^
The local variable failureMessage is never read
----------
----------
24. WARNING in D:\cc\cc-common\build\checkouts\hdk\working_jdktools\modules\jpda\test\common\unit\org\apache\harmony\jpda\tests\jdwp\Events\CombinedEventsTestCase.java
(at line 135)
long methodStartCodeIndex = lineTableReply.getNextValueAsLong();
^^^^^^^^^^^^^^^^^^^^
The local variable methodStartCodeIndex is never read
----------
25. WARNING in D:\cc\cc-common\build\checkouts\hdk\working_jdktools\modules\jpda\test\common\unit\org\apache\harmony\jpda\tests\jdwp\Events\CombinedEventsTestCase.java
(at line 187)
long methodStartCodeIndex = reply.getNextValueAsLong();
^^^^^^^^^^^^^^^^^^^^
The local variable methodStartCodeIndex is never read
----------
----------
26. WARNING in D:\cc\cc-common\build\checkouts\hdk\working_jdktools\modules\jpda\test\common\unit\org\apache\harmony\jpda\tests\jdwp\Events\ExceptionTest.java
(at line 188)
long frameID = reply.getNextValueAsFrameID();
^^^^^^^
The local variable frameID is never read
----------
----------
27. WARNING in D:\cc\cc-common\build\checkouts\hdk\working_jdktools\modules\jpda\test\common\unit\org\apache\harmony\jpda\tests\jdwp\ThreadReference\FramesTest.java
(at line 450)
frames.add(new FrameStruct(frameID, loc));
^^^^^^^^^^^^^^^^^^^^^^^^^^^^^^^^^^^^^^^^^
Type safety: The method add(Object) belongs to the raw type Vector. References to generic
type Vector<E> should be parameterized
----------
----------
28. WARNING in D:\cc\cc-common\build\checkouts\hdk\working_jdktools\modules\jpda\test\common\unit\org\apache\harmony\jpda\tests\jdwp\share\JDWPUnitDebuggeeProcessWrapper.java
(at line 233)
argv.add(val);
^^^^^^^^^^^^^
Type safety: The method add(Object) belongs to the raw type Vector. References to generic
type Vector<E> should be parameterized
----------
29. WARNING in D:\cc\cc-common\build\checkouts\hdk\working_jdktools\modules\jpda\test\common\unit\org\apache\harmony\jpda\tests\jdwp\share\JDWPUnitDebuggeeProcessWrapper.java
(at line 253)
return (String[])argv.toArray(args);
^^^^^^^^^^^^^^^^^^
Type safety: The method toArray(Object[]) belongs to the raw type Vector. References to generic
type Vector<E> should be parameterized
----------
29 problems (29 warnings)
JPDA exclude list: D:\cc\cc-common\build\checkouts\hdk\working_classlib\deploy\build\jdktools.jpda.exclude
Running JPDA tests
Debugger JVM=D:\cc\cc-common\build\checkouts\hdk\target\hdk\jdk\jre/bin/java
Debuggee JVM=D:\cc\cc-common\build\checkouts\hdk\target\hdk\jdk\jre/bin/java
SAMSA exclude list: D:\cc\cc-common\build\checkouts\hdk\working_classlib\deploy\build\jdktools.samsa.exclude
Running SAMSA tests
test.jre.home=D:\cc\cc-common\build\checkouts\hdk\target\hdk\jdk\jre
Run jdk/bin/java -version in D:\cc\cc-common\build\checkouts\hdk\working_jdktools\build\test_report
java version "1.5.0"
pre-alpha : not complete or compatible
svn = r608480, (Jan  3 2008), Windows/ia32/msvc 1310, debug build
http://harmony.apache.org
Run jdk/bin/javac -version in D:\cc\cc-common\build\checkouts\hdk\working_jdktools\build\test_report
Run jdk/bin/javah in D:\cc\cc-common\build\checkouts\hdk\working_jdktools\build\test_report
Run jdk/bin/javadoc in D:\cc\cc-common\build\checkouts\hdk\working_jdktools\build\test_report
Run jdk/bin/jarsigner in D:\cc\cc-common\build\checkouts\hdk\working_jdktools\build\test_report
Run jdk/bin/keytool -help in D:\cc\cc-common\build\checkouts\hdk\working_jdktools\build\test_report
Compiling TOOLS tests
Since fork is false, ignoring memoryMaximumSize setting
----------
1. WARNING in D:\cc\cc-common\build\checkouts\hdk\working_jdktools\modules\tools\src\test\java\org\apache\harmony\tests\tools\javah\Test\Test01.java
(at line 24)
private static final long xxx2 = 1;
^^^^
The field Test01.xxx2 is never read locally
----------
1 problem (1 warning)
TOOLS exclude list: D:\cc\cc-common\build\checkouts\hdk\working_classlib\deploy\build\jdktools.tools.exclude
Running TOOLS tests
test.jre.home=D:\cc\cc-common\build\checkouts\hdk\target\hdk\jdk\jre
The test report is in D:\cc\cc-common\build\checkouts\hdk\working_jdktools\build\test_report\html\index.html
The execution FAILED with the following exception:
The following error occurred while executing this line:
D:\cc\cc-common\adaptors\jdktools-test\adaptor.xml:28: The following error occurred while
executing this line:
D:\cc\cc-common\build\checkouts\hdk\working_jdktools\build.xml:242: The following error occurred
while executing this line:
D:\cc\cc-common\build\checkouts\hdk\working_jdktools\make\build-test.xml:97: There were test
errors.

***********************************************************
Unit Tests: (160)
        
error: testOwnedMonitors001 org.apache.harmony.jpda.tests.jdwp.ThreadReference.OwnedMonitorsTest
Unit Test Error Details:	(1)
                
Test: testOwnedMonitors001Class: org.apache.harmony.jpda.tests.jdwp.ThreadReference.OwnedMonitorsTestorg.apache.harmony.jpda.tests.framework.jdwp.exceptions.ReplyErrorCodeException:
Error 20: INVALID_OBJECT
	at org.apache.harmony.jpda.tests.framework.jdwp.VmMirror.checkReply(VmMirror.java:95)
	at org.apache.harmony.jpda.tests.framework.jdwp.VmMirror.getThreadName(VmMirror.java:699)
	at org.apache.harmony.jpda.tests.jdwp.ThreadReference.OwnedMonitorsTest.testOwnedMonitors001(OwnedMonitorsTest.java:114)
	at java.lang.reflect.VMReflection.invokeMethod(VMReflection.java)

***********************************************************
Modifications since last successful build:	(1)
            
add cc-hdk log20080103193526Lbuild.459 01/03/2008 19:35:26hdk

begin 644 execution_log.zip
M4$L#! H    ( *@#)#@CP'E1%Q(  (=^   2    97AE8W5T:6]N7VQO9RYH
M=&UL[5W_4]NZLO^9SO1_T#UWWER8(2;?("0WY0T/Z"T]I?01VO/>-'T=82N)
MP;%\)1O([9S__>U*=A+;B1."**%S,RUCR])JM9_=U7HMR^U!./0.VE?<&1VT
M \$.VI3(<.2Q-W_K<3\L2?=?K$7VR__Q][\=O'X5!0X-64G>^JW7KUZ_*DD6
M1D'IVKD).?=DZ4[JXKA:MEQ$V.PX"CS7ANL."02_9G9(?#IDQ/6).PRX""WR
M*2Z_Y$'I [ME'M8,F A'Q&$]UW=#E_M2'P.9GBMDB.V/6UW;AG\EFP^'W.]*
M6[A!*+MQ:Y=)ZW[H$>H[A/8I=IAO<Q6YGM.U!\R^X1&T'3@WW3LN;ER__ST9
M4'=(;UB&*@XP9#*$$1+\?67V@'\CK]XL^7MU"8VA$Y)T0JY<GPJD;EG+4T$V
M;(]1OX3,R!*,(8A")7Z;!Z/2M6"EGNLQC8@]&'(G6Q97:R4C*D&=2%]5 QO>
M.*[X1HX$4R#"26LU*>I*V,5WP1#YI^M XF#4J99+!J4C/@Q<#Z7__M/Q(8E;
M/!DS7=NC4K*DBVMZ2^UI)JJ-"I$\$C8C"A<2\B?JL^/ZV FT(ZXD/>I)MDW<
MOL\%\C%D0RY&9_3>'4;##G@" @:/2IHF4AK_TN45B_QQ>/'Q].,_5C<TK7K=
M:_ H:AS=N'4$3J#+1;]+ PHTN@,JH'@TJ2B[/0%N!2EVC]E5U.\S=L'ZK@R9
ML)#!-*]DDX8$A,_([OY6^M*&B)LQQZ*.L^G$U+;^3C(5_V_.+UWM<A2 (&F/
MA:,6N1PP$',XX."2@/;Y%3J^+7+%/.[W%? AU!#TCH38[(/KWS#G [!CD0O6
M YX /U6MSWPF7#M;K7UR0.2 1YX#-$E 428P%,#260[$>>75=0$7_>9YH&:$
M8ES+NUE@71]$X5/OT\23@[/<Q.EHF]Q2+P*,EX3XP6AC1QKM;;((]7=4#LYH
M4 AY7*?]^_:7)T*\MBZ(7SMW0?<3M6]8>.S*@(;0HMBF*Y5Z%GL(*_SPOR,6
M,674ZE33? CF)BU[H4T;L.;ZR\6P6F_F'3.$DHG1LCMR"O;<9V(3RT>:N-5G
MX:FSN;6UG:&[X#=%8A4?L.KO:7Q'2*\\MM![J%H&_,?N"]:Q_9R?P([AAD$K
MV:FS3>*"Y;7B5\!T[^5B6MO-S?O_QK2HO+%66'\9GKE"\ 7S^WXM9[B*CE23
MNSI<#*ZYR?Q0"#I:.*./:SUZ6M]_@9 UR]4L9+=4:,#@H!BNEPM5\^5!5:U4
M<U#U7.8Y&BP9P<W3$687WNK"D"MQ;6Y]=;^M'CR]7(@KY9>(<:T(8W7X*WO0
MN5@^<Q)+(1CGK\2Y?\PP3NF>^R#(NZ3X XU\>Y DN0IA;N;C6S1<<G)O,Y5#
M><M%0I:P^Y!!E#2Y2'YD&NM[I26L=X"I0^%2S_T71B^DH%>' ] ^#XG#H)9@
M!!](T! @[[D^]6(Z7YB0T/#SZ3%1NDEX3ZL$JM,C(7_FU):"_ 3S$;*KW.IG
MW^/460K?O!'K9RH$3ZTH=#UKDAO,FC-Y")P%=#&5[+-;P#*22_O,9\XN/4;H
MS496Z%? #Z,^".(\"L][9RJ/3M[H!/L<L9,% O>X#=H/D9&K+"A->BQQP>BR
M$G_F7-!C)%YI5+(B#Z(K#WR$HD20D#K:[(3J20:F=+=@AA'\3NHZ'WGXED>^
ML\BYD64F-L'"2/C: 6D.>ESDN-@B/<&':IZ;U,R,^BB2(1]^@"( TV<,W"\Z
M=T"!.7";ZM]JOX<S(9Q!+T,\5)3:_WDPJP--:TF=>.;<S>-T(I<?3.D$S!YK
MH!-9+M9?)^;JRC/GA%*ZPH=7N!1 GY;+57PH5*PMY?(\I\WN PA-CS@ZW#"A
M"<Y[$_MESID*8CLA%5#'8:>^P^[)FS=D^NH)@)Q<RT7-,_W]TGY_-G<K^/^Y
MN#YS_J<(U]I"7'=K.2<@W%N0%!G#B[1BF.[=\(+9S+T%0UHP.Q>B-@LW'9;.
M'L$\'E(P:N2]T9*P/7,.Z'&P-?9F/)LE)__SZ>3H\N3X^\F7DX^7G>]'YY\_
M7@)0V?+#BXO#_[4\YO?#P2S\5K.TV;V;M+1GS@7-AVPA7OGG)+\07M5GSM\\
M I=J)7\#^ L!LP[)F-6 J=5SRXI^)6#6*67R,& :^91)?'_0HZX7"7;&I*1]
M!J#\]M>_DK>'IQ\^7YP0)U)UU)CP0,WH\B_D+[\ME559"$VF\U4P6:>,R@-G
MEWR:<G5,U@B2N5"M4RHF!]41E0ONO&NY)^R8A8W3_=D[)=7F$B5Z@6ML<('.
M1W8??L'E=H=P9^KW-V??,JWDXF;RL(HUK5-F9 6(]G,YRB*(Q M"9BYB:Y2?
M&">4%N<E]G-Q@@)*/=,[/9Z#S5M]M1B>Q0XN[L,D".N03+@<X$#&CQ&[2EJ+
M9Z'Z;BY%-+6F!-<;*D(P,T5VN!D+;QN%NK4.3[V_P%4N"A^?ZBI/MT1\'5(2
M$BZP[OOC/SY]AA9)3O63X" 0^8>@0;!H36 MEU*BHG\;KU/Q?M8ZE9\'9W4=
MTA*/ARV?"8PS\G'F_>NW+85CLEH%3N3<7.WXMZK%)KUHF*'OM0 :WZL#SS^4
M9!-.[JCP03!R"U^6"F"> 0A*[-[V(H=E7IA2KTG%ET#>,GS82U'J\;_G7G4=
MF,SX**Z;:(^%RF#%U.,7!V>^MG41^?ZLE[:2ZX2,5Q6\_W+V9AD.(1R!J54=
M7N-_P78@UMJ9:%J.-C-'^^LUFL=D7& GEK83*[83+1HU5 OMQ/KBBC"BWAE4
M JVWXF41.+>E26*))/@&)JELD[?Z5D:V2'F;G.#B('UXZ0X981X-)'-:9,^J
M[]:(9/;C2>U:Y?J>,5)[:\E58]_< *MK*"NXAR@D55N65&77JC5V"VE5EZ95
MMJJ5ICEU*![B0Z15K1N35KE2K*7U96G5]JQ=D[IEB%3=:NX9PW#7'(;U<K'<
M]Y:6>]6J-(J%]0"--R;T_6(5?8BD3)$RRE5UOV*,5+-8JY8VP4K3G+(;%5:Y
M9DA8!KD"4C5#LRJ0,A7,(%?&?,PBW_[B!]C8-S?AU,Q-."8=EL%8IF;,GANU
M8K:>25CF)GICEF-(3A#SE<T-SM3=Q/JZ4'-<&=.I]>,(M-R8>IJ\K3059)MU
M+@;5LVDN1C.81#&E#*BBIM(5:R>GM25E3.169;=X[ELZNU#%3(4Y#V/J'@)(
M-<W=G"ZXC7\N6S;'U8((]#DF0(.S>S&IW0>H>JUBT)C-31#5U>;ERC+PG70N
MEWF.D'E&;IW?^<PYXT #ND)>U"JKD^.U2LM4#,8T%8-*NT3*]EEH[5K-!:[P
MIV<A41N,1:6+<JP&)UB#GN(A^8%*L>4\A-2BN7KY!Q0-JU%>OR<!9D.W%5WT
MS!M?<[=.!KDR%2-5S3V/JYM[>FDX9;M^&2.SVFXP8#9HSN6Y",Z*359?1/&.
M>U-K:Q_/>M/<X[&]AK5?-X0SN&U#>MPPE\V#\9GCJM$TM[K#5 P&"#;+QD:X
M7S$T S3,32:HHPOBE ?1:ABRG88YO[9KSJ_MX>U[;-&O7X4\L@>E^$T3J79E
M;TW*F2(R5<K&N[.W%J_9ZQR>=9YPT9ZD0SFU:@_[M;EO4Y#+1P[=NGI[>[VA
M.6[![W/B,WQGGH3L/MPF#E>[,O!PH'887[SL3P](U4A7P"+K6H##YT.VXM*\
M7)>X,?]XO1XI)9LNK+I"=L[F]]#A/;._D4,U8Y%W>L8B>HLG)DB+;-I;Y(@'
M(^'V!R&I-)N@:M4RS(VXVC1NUN&]\ [W3E+;65"UE047Q 7M]%R;^1+4:)M0
MP"%0'V/ ;2?3_:M!)F/\K6*!!_R-I*N MI6H%PPH,(7[-<'H X^%#'O"8^@6
MZ*;;R%L?7V'8*^_7]\$4-M]3GY :\K^_M4W^<'V'W\D=E]:J.T-Y:Y-*K0+5
MU([K1$DL36X0AD%K9R>9U^-I'F;\8O3L)X?OQ/9<L&_R'L6H-_8'\,I6HP%H
MU:R:!:.:@'CZ7V=P)@*40UFC:9%#SR/J,G@4)IFX98Y5/*S!4XWF_<?3DOHH
M"!DPM0F)-F*U)IGB8N5T]?399WQ;KC4K#(L7^R+GUAE^CN,KU_NX?R-MO4$8
M;M$B#XJHCYNDBPDI77$>*BJ@B /2QK\'RD;Z+L1V1)7>N2!D7#P-HV:^@ZZ(
M9PG-_N&2;8?U:.2%\69F2+!0$,!3CA_\S>$)E[C_!)8X:2.:!RE2J'M(3G\]
M9,R28(XKF(TNV_4?PI8,F.WV7/6MEIRKR;'DD+;NAXO1F*^$I90&)HS9\=<Y
M0(=2W2W'X;@S<C=P[4&>:@\\IWXK"M\^H&*T: 2N#Y:1[>94%<:?X9A2/?5*
M W1#HY /P6FJ33\6]0#^ZXJ#@\G"AGL9B7A^1 \ =S&+^$W9VC0U%2.HC?5P
M.Y,(N"+_A-LD#>14H^6D+#$V4?*\&N&>?N +LIIPP20H+P1/Q7[.X?:3>3H@
M?XSD]1:$+LYH*$/@>L3"(K9@.NDCOD_&F.CH#@;,"ZQ9+G9CPL2/V"O^2=X?
M7JAXD0!N-(/45 /4)[<WFM&P2'/B5AOP(S$! !8I.MB>Y-N7;MA(@JDQTDZ.
MOBM/N*%>1M2!BE:XY'J&@"I3;\%,*. I4%"E2[0.4'.G^Y<2X'" PIB[I"S/
M_;CQ5+L-DFPR!.7CMF03'(?C]GH0:NA-N&;TN95E4$D/@-%N^3L:&':@/I$5
MCZU8PG!5 3Z[O=5YJX)OZQA"9^5$\Y JQ[*A1L5O7;A7H(ZC/KE%O7A&R'7I
M@8VDF\"0V5TR@<!9P*7,QX,EFPD(<)0&.:X,/#HB6 0^!K>WDF0S E[N7)@7
M$Q5%[A,NL](+)27MR\[A]\\7'PZ09DJIX+X+%( . W2U R[<<)1OC[UK&GCT
M79G-M&:H@@0)J#;-;H8:R.)^1-H##C8-(H0H3A[\:+71N _^5**"RRJR ZN&
M2B2NI(:(M;8)L_J6KFCIBA;XE%:E6JO/ZDN;!?X=XSYM$ZD.-]]=7G["4+US
M?O1[)RO(&$:AO;R>(9#<Q.LC45N,@I#W!0U@WE2$X>8B40$QAZ1JW$[X2TH5
MS:RUR=EL/(@+M>O>D/JTCU/B'+<PZ2G-W<0?%+ )!F>*3YP5M+:CC=,0DP#S
M>TOS.FY1R"QJJWENITVVH,-IAJ?;%'(\=,SS.XSW\'#<?BI[D.TQ+>%TJSE,
MYT(#T"&<X4D))^ZG"@_29[_'748J+DA?2]CY46K'7[W0ON+/Z1(=!6!96Q]^
M5U_#.OC3LBQ2>M_&*"RI5,B(S^_\Y.L:,L/)AM(-P?ZYL?$/?2?)4DH!5Z)Q
M_GVJ$0K*%M[&QA$>I:<+P6X3CX^;1D?9B*>DM\L,H;$^F)AXR,'O\G"@E04"
M\6Q3AV%V V:5"S;DMXS E >W#&IBG^U6-DKL'J&")B?J(#4\[$_-P.B$9>CP
M[+2Z48(;;* ,S3L,[D44KUA9!QFN2&[ 8;39EJAKT.YR (&LTKM$=[D.( D(
MB"; 9!OKK9VA^:G>XYFF^-ZT!W"OOH64*#GJ7.@-*;(T@$?;XSZ(:_R]3ZB.
MG"NQS:BN0B('4:5^/QU)96M#M.6'MH+Q$QZB++4$,[PJ</(QTD9),J^G"8Q5
M#R)7*(P#L!05Y3+&"4Q@+$<MB2K3_!>%DAN3V/E+$CE/]ZF$7&1:[Q#%(@/7
M_N9'QLHS:2H(+UH;F29:Z[)]Y[/-RWQ.\_+\_$,G]3W-^-WS297=?W_J,K5E
M@CZ3PM;[)F 'LS9,T"/5E54*37T(4?TI5Q9\2&W>%JFI??;5MC/W]_=5\H94
M%NZ+,/[-WFE&;X8:,Z>(/F:KTV3; K)9238M6&+/ JV+3_;\0__]F<\_<L9E
M_OG'$@_3)Z/'SP#(^+DZA" ==']ZI^D.!:0+'Z8OO7*I9NY9\ZYEZ,6M\N1]
MB,<^PM/A30G<5(D-@W"D"^,DX511O@03="4=&\*Y'HX^A4$)ZDN],3@PWB+U
M^EYSF%$:-%/DANA&:*#&@M4N?F6\Z^(67Q8>(K\2[L##"<.O7\&\,WVJ!:'D
M(W1>\/6K5\@DSDB1"O'TL@\]/ZL<)<<$J-KZ+]EPJZ6:3%U ^1-NVY$08'EW
M ]<;4X3+(09,Z"7Q0^69H5.'!K@:=FSRBKFD&+\!WJKNZTU?C/2WO*AUW_7J
MS^Y<?09]$@8H-IH-Q04$/G?X1VF45GH+0&WOT(/VCOK._([^YOR.^@#]_P-0
M2P$"% ,*    " "H R0X(\!Y41<2  "'?@  $@              I($     
H97AE8W5T:6]N7VQO9RYH=&UL4$L%!@     !  $ 0    $<2      $! 
end


Mime
View raw message