harmony-alerts mailing list archives

Site index · List index
Message view « Date » · « Thread »
Top « Date » · « Thread »
From nom...@intel.com
Subject [build-test alert] FAILED Linux x86_64: reliability
Date Thu, 03 Jan 2008 10:15:56 GMT
svn.revision=607816
BUILD FAILED:
	Ant Error Message:
/export/users/cc/cc-reliability/scripts/cc-exec-adaptor.xml:104: The following error occurred
while executing this line: /export/users/cc/cc-reliability/adaptors/reliability/adaptor.xml:100:
Some reliability tests failed on /export/users/cc/cc-reliability/build/checkouts/snapshot/hdk/jdk/jre/bin/java

Date of build:	2008-01-02 22:48:36 +0600
Time to build:	1,047 minutes 13 seconds
Last changed:	01/02/2008 22:23:39
Last log entry:	snapshot

***********************************************************
Errors/Warnings:	(88)
            
[java] Java Result: 104
[java] Java Result: 104
[java] Java Result: 104
[java] Java Result: 104
[java] Java Result: 104
[java] Java Result: 104
[java] Java Result: 104
[java] Java Result: 104
[java] Java Result: 104
[java] Java Result: 104
[java] Java Result: 104
[java] Java Result: 104
[java] Java Result: 104
[java] Java Result: 104
[java] Java Result: 104
[java] Java Result: 104
[java] Java Result: 104
[java] Java Result: 104
[java] Java Result: 104
[java] Java Result: 104
[java] Java Result: 104
[java] Java Result: 104
[java] Java Result: 104
[java] Java Result: 104
[java] Java Result: 104
[java] Java Result: 104
[java] Java Result: 104
[java] Java Result: 104
[java] Java Result: 104
[java] Java Result: 104
[java] Java Result: 104
[java] Java Result: 104
[java] Java Result: 104
[java] Java Result: 104
[java] Java Result: 104
[java] Java Result: 104
[java] Java Result: 104
[java] Java Result: 104
[java] Java Result: 104
[java] Java Result: 104
[java] Java Result: 104
[java] Java Result: 104
[java] Java Result: 104
[java] Java Result: 104
[java] Java Result: 104
[java] Java Result: 104
[java] Java Result: 104
[java] Java Result: 104
[java] Java Result: 104
[java] Java Result: 104
[java] Java Result: 104
[java] Timeout: killed the sub-process
[java] 	at org.apache.tools.ant.taskdefs.Java.fork(Java.java:754)
[java] 	at org.apache.tools.ant.taskdefs.Java.executeJava(Java.java:171)
[java] 	at org.apache.tools.ant.taskdefs.Java.execute(Java.java:84)
[java] 	at org.apache.tools.ant.UnknownElement.execute(UnknownElement.java:275)
[java] 	at org.apache.tools.ant.Task.perform(Task.java:364)
[java] 	at org.apache.tools.ant.taskdefs.Sequential.execute(Sequential.java:64)
[java] 	at net.sf.antcontrib.logic.IfTask.execute(IfTask.java:197)
[java] 	at sun.reflect.GeneratedMethodAccessor13.invoke(Unknown Source)
[java] 	at sun.reflect.DelegatingMethodAccessorImpl.invoke(DelegatingMethodAccessorImpl.java:25)
[java] 	at java.lang.reflect.Method.invoke(Method.java:585)
[java] 	at org.apache.tools.ant.TaskAdapter.execute(TaskAdapter.java:123)
[java] 	at org.apache.tools.ant.UnknownElement.execute(UnknownElement.java:275)
[java] 	at org.apache.tools.ant.Task.perform(Task.java:364)
[java] 	at org.apache.tools.ant.taskdefs.Sequential.execute(Sequential.java:64)
[java] 	at org.apache.tools.ant.UnknownElement.execute(UnknownElement.java:275)
[java] 	at org.apache.tools.ant.Task.perform(Task.java:364)
[java] 	at org.apache.tools.ant.taskdefs.MacroInstance.execute(MacroInstance.java:378)
[java] 	at org.apache.tools.ant.UnknownElement.execute(UnknownElement.java:275)
[java] 	at org.apache.tools.ant.Task.perform(Task.java:364)
[java] 	at org.apache.tools.ant.Target.execute(Target.java:341)
[java] 	at org.apache.tools.ant.Target.performTasks(Target.java:369)
[java] 	at org.apache.tools.ant.Project.executeSortedTargets(Project.java:1216)
[java] 	at org.apache.tools.ant.Project.executeTarget(Project.java:1185)
[java] 	at org.apache.tools.ant.helper.DefaultExecutor.executeTargets(DefaultExecutor.java:40)
[java] 	at org.apache.tools.ant.Project.executeTargets(Project.java:1068)
[java] 	at org.apache.tools.ant.Main.runBuild(Main.java:668)
[java] 	at org.apache.tools.ant.Main.startAnt(Main.java:187)
[java] 	at org.apache.tools.ant.launch.Launcher.run(Launcher.java:246)
[java] 	at org.apache.tools.ant.launch.Launcher.main(Launcher.java:67)
[java] Java Result: 104
[java] Java Result: 104
[java] Java Result: 104
[java] Java Result: 104
[java] Java Result: 104
[java] Java Result: 104
The execution FAILED with the following exception:
The following error occurred while executing this line:
/export/users/cc/cc-reliability/adaptors/reliability/adaptor.xml:100: Some reliability tests
failed on /export/users/cc/cc-reliability/build/checkouts/snapshot/hdk/jdk/jre/bin/java

***********************************************************
Unit Tests: (58)
        
error: test vm.classloading.ClassCastTest
Unit Test Error Details:	(1)
                
Test: testClass: vm.classloading.ClassCastTest

***********************************************************
Modifications since last successful build:	(1)
            
add cc-snapshot log20080102222339Lbuild.46 01/02/2008 22:23:39snapshot

begin 644 execution_log.zip
M4$L#! H    ( /F!(SC5[2G;U08  'DL   2    97AE8W5T:6]N7VQO9RYH
M=&UL[5IM4]LX$/Y\_ I_N2DW<S@OI4!S'#,A!)I.*!T"[4P[#*/(FUB-+/DD
M.9#^^EO)22X)$!(G]H?.S4 LV=(^^R;MKNSCT$3\Y+@K@]')<:S@Y)AXVHPX
M_/VF)X79T^PGU+RC\N]_O3G92>* &-C30U';V5$)_GJ>]ST #@;NO#-[9:+O
M!4P!-5*-O!(\QE*94J)!Z1*E^+>G@#/299R94:F;,!Z4%.B$&UV:?<*)-I8Z
MTO]!AN3..[5#>XPC-XCL/T9\[K%K1@.$OO,:"I#-P/)1VX"%:KE\M%>N[)6K
M]]7J_M$<W%S'\D-BYO]D<>T)4]YWH*&\\ZX3(:QR#&A3\\;#_7K 036N&V^K
M-[ @\&S[(_YZUX['FE<I[Z^)<O&-Q2UQE9B.0=5$>4*U1(^?08]?@$$B8/+$
M*DZJ;YQUK53H5JH '-3;&:.&24'4*&\\2Q\UB*+U1VT8PM-UM66P+T3A&N/0
M!M$W83:T9]?? )0 [A/5U^NLPYEI?CV.OUPVVI^)RL^A9O&:CT";8E@$E)-+
MR1B48:"S(RY3/: XM95'AU(.LEC*S<.M,[B..J$)'L0'>R,?B63W!\:R#$RF
M$_TK=VEP*2!G(\\!GC-!.(;N(C%QRZ<8MO4'HD,J@PVPEQDDIH/^ZBZFC4+&
M,Y@OG8CA3(/0S+!AWJJ< F*($85BA1@] ^P7 ]IQETW%7&9SXP3*8/-T(G)(
MZ.!&$>I,OM#-44$I?%_))/:;(HG QN1",/W4!SJ)CD$$EF $S]W+GY'.2-!0
M2<%^$IO^3/K%:&$)>#5_]*] !M?0 P6" A%!JG_G@B\_RF7UR >;GJV^R49$
MD#Y$(++$R?\FH[ZU@0B9EHFB<*48WH2<Q*0RBK&85!DXGDSU/S+3&+=S87(%
M"QAX7$OI=KQ_BMXS:!F[OTAU7^>\+2GAH//P<0=X!I1%A)]+%1%SGS=:'TQ]
M2!AW-4:*==^0/&-=\ZS:!9,^#8G"0FT=[<],\QM2&,+$!FGKZEA-0=$$!2%)
MFTM<8OY7B&A?<;_N-]+.)Q)M.^D<0PE<C6M5*K/S?'MJ->[XC?1ZWKKJY*R>
M9[!E/#K'?MZ&>8IL4<>27Y(X!QMUDQZ&Q[5--)[FGXX,G+HVX1RW# -G[@PS
M3T4]Q;;!A!0-^CDQ::,(6+M04[0.9_DEU,]#?E4DOLCO1/)ET"(0SV2"X:YP
M0<^Y)*9P5*P>"\=L8YPI'+032K4M45_:.U?(,A<'+1< ^6]=;9O/-1,MS P^
M&!-CDB7 ':3G9BU$^@2FP6VQLB6!AY&O[:'#*Y;!8>Z\#9=@L,8AU\(TOV$[
M#:*7N]8-BT F.'W .(? ,R%X.NGNQ4I2T"\G\[\1XTG51R,2&H)OI,34@&"Q
M9X@>!-#3OM6-WY-JL.M:=EKM\-W^'YN2M&?1B0';GJ%<.:QLB_(,U:,L[-Z*
M@9 /HLG3ZG="=>&VHU\]?)<!X :Y]F-0J-QHUW4<L;<'&RFW _\DR!@C?,KR
MS"V'\!J 732Z9\E2K((4Z_I<]AGU6SW'Y83LN)O:[?WA<IH:5X2"'K?GT1<@
MW.%9< DFE$&=6A>5JO+69V(H!U,=>QUWTK Z8?N*NT_L2^YYRJTHYA/:2\>D
MUGS%F+;E<X)K<X*;4IH@C'N.UKNCK)Y1#TAL0$VU/7LO57GU[?]>O897_TKJ
MN"14R9; ,"0H3+F>OYOB'![]\EJY(:H/9F:AN&Y*<#]+.!E3&/-GV=/S5 _>
M9Z#Z64GW-F[,9P=31PA2LGIW\G"\LBL'FP.DI!<H5S+M1R%P5 9NKSV"*5+3
MT9=J'DCO+CYVB/OE;4FRJ*3R01;7OB0,XT4BW/=*NZZ7[A[9J>%Z4Z8NS RU
MRM$KX?!9:IPD@H9^VUU0W\CF[K23KK;]+(ZQ2#="/A<('RSP^UPVVTM?6KN7
M+VMDL[/3_,F+[QS?(B D/%*(+=[*)TYSD_SFM+E=OOIT#7[Z=/)B*9<#P13A
MHK%5"5<H5A/#^#JUHAUO3^-IHA2ZRI8+5XT;C&)FM Y'DSF8E*0-5Z)=@_W\
M;-NOPS0H]L*B6QR_Y.GI;:M]YG5N&XUFIW-^VYY[>",-X9[! A)Y^K.\?^A%
M3."NJY%##V65(DCKQRU_OSGS"2F5\0CIXJ_5=*5RX-G3:>T9N2G]G1LLA-,P
M@@KTSNNM=O/,>V F="5R3W(N'RSH=/77W)29!TI)Y4GJ_"_P'D+D;$+1ND7(
MM,>9@-K.:ZP2F[U+-<_E^*;]8!9#6KF&-4\$WLP(YWC:ZQ%FZWJ4836-X-9.
M!S)!G6A!8AU*4PJ#0>F'_5=0ZC)1LN;?.2Z1D^.2^[*XE'YE7'*?'/\+4$L!
M A0#"@    @ ^8$C.-7M*=O5!@  >2P  !(              *2!     &5X
F96-U=&EO;E]L;V<N:'1M;%!+!08      0 ! $     %!P     ! 
end


Mime
View raw message