harmony-alerts mailing list archives

Site index · List index
Message view « Date » · « Thread »
Top « Date » · « Thread »
From nom...@intel.com
Subject [build-test alert] FAILED Linux x86: struts_test
Date Wed, 02 Jan 2008 20:19:39 GMT
svn.revision=607816
BUILD FAILED:
	Ant Error Message:
/export/users.2/cc/cc-suites/scripts/cc-exec-adaptor.xml:104: The following error occurred
while executing this line: /export/users.2/cc/cc-suites/adaptors/struts_test/adaptor.xml:67:
The following error occurred while executing this line: /export/users.2/cc/cc-suites/adaptors/struts_test/adaptor.xml:229:
Test failed

Date of build:	2008-01-03 02:19:10 +0600
Time to build:	24 seconds
Last changed:	01/02/2008 22:16:34
Last log entry:	snapshot

***********************************************************
Errors/Warnings:	(2)
            
The execution FAILED with the following exception:
The following error occurred while executing this line:
/export/users.2/cc/cc-suites/adaptors/struts_test/adaptor.xml:67: The following error occurred
while executing this line:
/export/users.2/cc/cc-suites/adaptors/struts_test/adaptor.xml:229: Test failed

***********************************************************
Unit Tests: (1)
        
error: unknown org.apache.harmony.struts.test.WebAppTest
Unit Test Error Details:	(1)
                
Test: unknownClass: org.apache.harmony.struts.test.WebAppTestjunit.framework.AssertionFailedError:
file520468537.html: Lines 147 don't match:
Remote: "        <p>Copyright &copy; 2003-2008 The Apache Software Foundation.</p>"
 Local: "        <p>Copyright &copy; 2003-2007 The Apache Software Foundation.</p>"

	at org.apache.harmony.struts.test.WebAppTest.checkResponse(Unknown Source)
	at org.apache.harmony.struts.test.WebAppTest.performTest(Unknown Source)
	at org.apache.harmony.struts.test.WebAppTest.launchSpiderR(Unknown Source)
	at org.apache.harmony.struts.test.WebAppTest.test(Unknown Source)
	at org.junit.internal.runners.TestMethodRunner.executeMethodBody(TestMethodRunner.java:99)
	at org.junit.internal.runners.TestMethodRunner.runUnprotected(TestMethodRunner.java:81)
	at org.junit.internal.runners.BeforeAndAfterRunner.runProtected(BeforeAndAfterRunner.java:34)
	at org.junit.internal.runners.TestMethodRunner.runMethod(TestMethodRunner.java:75)
	at org.junit.internal.runners.TestMethodRunner.run(TestMethodRunner.java:45)
	at org.junit.internal.runners.TestClassMethodsRunner.invokeTestMethod(TestClassMethodsRunner.java:71)
	at org.junit.internal.runners.TestClassMethodsRunner.run(TestClassMethodsRunner.java:35)
	at org.junit.internal.runners.TestClassRunner$1.runUnprotected(TestClassRunner.java:42)
	at org.junit.internal.runners.BeforeAndAfterRunner.runProtected(BeforeAndAfterRunner.java:34)
	at org.junit.internal.runners.TestClassRunner.run(TestClassRunner.java:52)
	at junit.framework.JUnit4TestAdapter.run(JUnit4TestAdapter.java:32)

***********************************************************
Modifications since last successful build:	(1)
            
add cc-snapshot log20080102221634Lbuild.76 01/02/2008 22:16:34snapshot

begin 644 execution_log.zip
M4$L#! H    ( '(2(SAV+&^BN@(  /0'   2    97AE8W5T:6]N7VQO9RYH
M=&ULY55+;]LP#+[G5Q %MEYJ*7'3I'.S ,7: @.R2]=AAZ(8%)F.U=J2H4<>
M^_6C$@=;VFY(N\,.$VS9)DU^(JF/&I6^KL:CJ<E7XU%C<3P2X/RJPO>'A=$^
M<>H[9G#:?7-V..Z$)A<>$S?76:>3./2A2:31N?+*:$<R&T@# +<Y5NCQ#B[B
M4^E9!AR7C;&>!X?6L91+25?B@O+H^#2H*N<67:B\X\[;X-TW4G@NA1>5TH*9
MX)_U#+FR*+VQJ]="Q"EI%1$";NL'<GH''RQ2N'E$>/7Z=YQW$LIP(RPFVT01
MF#3-BK!HCM'TH% 5@C?[ ,H2Y0,EAB"U:%QI/"_S!WX?;XN\4E,^-<83[D(H
MGQ3&4M'L'.GAA:70VC)NI1$OBFB]3X5KDU:XM9O7PLX>_QCT;U44=A(SLHG]
M]CYHY>_@.F@=8S=VQD0C*"I6"EL;O6*;5+)HP[[B]+QI;NAUQSJA\>5Z KTN
M#49OK"U FE!&%E(X3%+690.^_63WKLD@^HRHL%"^7&?]).WV!Z<GQT,62;$#
M\E2=P41I=-#K#R$W^M!#+;PL'T6&M?'$GP-HQZ@9QTI;-2L]O(VE/X.TVSU.
M:#J%FQ+A?)T ^&P*OZ"= E<F:&(=$8R->#,^V/$/$R-%M:?_X<O]_Z=A[WS$
M#><@$A9Z1W E5!6('QETC^#26F/=6GZC:@2LB(7$*NBS01\<RB>.]M_C<'7^
M<7)YT=E84]L@"I$/*[0C'M?@"3"#8=JK7=M(:C.GOOC)S%_<1YYI7$360FGE
MRC5G59$4%/BF8?R49W^-O'<'BS7$)<H02];F9L-<3YK"5)591'1<2FSB/]G:
MY!=%K!48*8.UU-,795QDZY'4OE0.Z*#!K//'98M<-'38[#;Y5LB6Q(_!,(-_
M@YRF[[+-)MO4JC/B8DR;.Q[J?'/ \_5I_P-02P$"% ,*    " !R$B,X=BQO
MHKH"  #T!P  $@              I($     97AE8W5T:6]N7VQO9RYH=&UL
64$L%!@     !  $ 0    .H"      $! 
end


Mime
View raw message