harmony-alerts mailing list archives

Site index · List index
Message view « Date » · « Thread »
Top « Date » · « Thread »
From nom...@intel.com
Subject [build-test alert] FAILED Windows 2003 x86: struts_test
Date Wed, 02 Jan 2008 18:30:04 GMT
svn.revision=607816
BUILD FAILED:
	Ant Error Message:
C:\cc\cc-suites\scripts\cc-exec-adaptor.xml:104: The following error occurred while executing
this line: C:\cc\cc-suites\adaptors\struts_test\adaptor.xml:67: The following error occurred
while executing this line: C:\cc\cc-suites\adaptors\struts_test\adaptor.xml:228: Test failed

Date of build:	2008-01-03 00:29:10 +0600
Time to build:	47 seconds
Last changed:	01/02/2008 22:22:31
Last log entry:	snapshot

***********************************************************
Errors/Warnings:	(2)
            
The execution FAILED with the following exception:
The following error occurred while executing this line:
C:\cc\cc-suites\adaptors\struts_test\adaptor.xml:67: The following error occurred while executing
this line:
C:\cc\cc-suites\adaptors\struts_test\adaptor.xml:228: Test failed

***********************************************************
Unit Tests: (1)
        
error: unknown org.apache.harmony.struts.test.WebAppTest
Unit Test Error Details:	(1)
                
Test: unknownClass: org.apache.harmony.struts.test.WebAppTestjunit.framework.AssertionFailedError:
file520468537.html: Lines 147 don't match:
Remote: "        <p>Copyright &copy; 2003-2008 The Apache Software Foundation.</p>"
 Local: "        <p>Copyright &copy; 2003-2007 The Apache Software Foundation.</p>"

	at org.apache.harmony.struts.test.WebAppTest.checkResponse(Unknown Source)
	at org.apache.harmony.struts.test.WebAppTest.performTest(Unknown Source)
	at org.apache.harmony.struts.test.WebAppTest.launchSpiderR(Unknown Source)
	at org.apache.harmony.struts.test.WebAppTest.test(Unknown Source)
	at org.junit.internal.runners.TestMethodRunner.executeMethodBody(TestMethodRunner.java:99)
	at org.junit.internal.runners.TestMethodRunner.runUnprotected(TestMethodRunner.java:81)
	at org.junit.internal.runners.BeforeAndAfterRunner.runProtected(BeforeAndAfterRunner.java:34)
	at org.junit.internal.runners.TestMethodRunner.runMethod(TestMethodRunner.java:75)
	at org.junit.internal.runners.TestMethodRunner.run(TestMethodRunner.java:45)
	at org.junit.internal.runners.TestClassMethodsRunner.invokeTestMethod(TestClassMethodsRunner.java:71)
	at org.junit.internal.runners.TestClassMethodsRunner.run(TestClassMethodsRunner.java:35)
	at org.junit.internal.runners.TestClassRunner$1.runUnprotected(TestClassRunner.java:42)
	at org.junit.internal.runners.BeforeAndAfterRunner.runProtected(BeforeAndAfterRunner.java:34)
	at org.junit.internal.runners.TestClassRunner.run(TestClassRunner.java:52)
	at junit.framework.JUnit4TestAdapter.run(JUnit4TestAdapter.java:32)

***********************************************************
Modifications since last successful build:	(1)
            
add cc-snapshot log20080102222231Lbuild.61 01/02/2008 22:22:31snapshot

begin 644 execution_log.zip
M4$L#! H    ( , #(SA'%1IVOP(  +T'   2    97AE8W5T:6]N7VQO9RYH
M=&ULY55+;]LP#+X'R'\@"FR]5,ZCCP1N%J!H5V! =NDZ[% 7@R(SL5I;,B0Z
M:?;K1]E)M[3=D/:PRX18L4F)G_CXJ%%&13X>36VZ&H]*A^.1!$^K'#_LSZPA
MX?4/C&'8?7>Z/VZWJC*5A,(O3-QNM5O"(U6E4-:DFK0UOI:Z*F@!X";%' EO
MX2+\:S./X3Q.E.*?\)4F],FTTGF:./153C[QY"KRWUE!B9(D<VUD9"MZV1JD
MVJ$BZU:O,!LFL5;49N&FN&=#MW#ND'U+@]77G'/;(,>$@UA*A^(Q# RA;+EB
M!)[#N7LPTSD"V3_ J S5/;O-0$:6/K.49.E]<A<>ATFNI\G46MID@!^W0"=*
MZZA)"Q_G);$GZ3;B1K*4FL3,NLW:>@6FC\D5BT*Z^7-+E?F+DAT7(2IK[V_N
M*J/I%JXJ8X+WULTC64IV,LJD*ZQ914T\H[ I^H;3L[*\YM?M[8+'UZL)]+H\
M(GZ+.LVVON (+97T*/I1-SKI;#ZC.U_&$(P&6%AJRNK '_>[1R?#X\-!%&I_
M&^6Y/H:)-NBA=S2 U)I]@D*2RIXZAX4E)LH>K,>H'(=T.SW/"-Z'_)]"O]L]
M%#P-X3I#.*MC %_LC)9<+W!I*\/L8AI%HTXYWML&@(E5,M\18/ &@/_7\^VO
M4'D> GFA=P"74N<5TRF&[@%\=,XZ7\NO=8& .;.3V0*#Z/#H$#RJYZ9V+W>X
M//LT^7C1;C7;N8LPH]B(D\8S10L@QF2L8:_PF[Y2V 4WQ,]VL4M;>:%[U7R=
M::-]5M-6S\2,/=YT@%^:^$V(.S>R5L@:/J"J0I+6D6@82ZR9V3RWRX"(#PK+
ML":NM_RF"+D!JU3E'#?Q918.MK;(:LJT![Y.D!UY>E:9RI)OD>VVOA9&#\R#
MDT$,_PZMWQ_&3>DTJ>!$C#IRS(4;;N=.<U-WZFO[)U!+ 0(4 PH    ( , #
M(SA'%1IVOP(  +T'   2              "D@0    !E>&5C=71I;VY?;&]G
;+FAT;6Q02P4&      $  0!     [P(      
end


Mime
View raw message